program: Gaussian 09
title: 000000345
version: EM64L-G09RevD.01
frameworkgroup: C1[X(C7H8O6)]
method: RPBEPBE
basis: SDD
operation: Freq
keyword: #p
keyword: freq=noraman
keyword: PBEPBE/SDD
title: #p freq=noraman PBEPBE/SDD
converged: YES YES NO NO
title: Mulliken charges:
elementType: O O O O O O C C C C C C C H H H H H H H H
charge: -0.433121 -0.409864 -0.412847 -0.231924 -0.233098 -0.251423 0.257984 -0.625195 0.123840 -0.737579 0.104523 0.211201 0.111866 0.281715 0.334196 0.256586 0.257672 0.239048 0.387835 0.379849 0.388737
chargesum: 0.00000
title: Mulliken charges with hydrogens summed into heavy atoms:
elementType: O O O O O O C C C C C C C
charge: -0.045286 -0.030015 -0.024110 -0.231924 -0.233098 -0.251423 0.257984 -0.009284 0.123840 0.015726 0.104523 0.211201 0.111866
polarizability: 1.29599557e+02 3.64720862e+00 9.98939846e+01 -9.88085839e+00 9.45706274e+00 6.59258013e+01
1716.lowfreq: -51.7042 -5.6687 -0.0006 -0.0004 0.0006 4.0480 9.5272 28.0655 41.1474
frequency: -51.4436 27.9550 41.1289 50.4690 76.0270 81.9085 121.2345 205.5991 284.9765 293.7813 329.4249 356.6787 364.9185 386.9714 458.1423 495.3069 516.8241 552.5428 577.9238 603.7891 625.4914 630.8152 644.7703 684.8559 734.2928 776.4392 812.3668 877.1708 936.9368 1007.0360 1030.2520 1041.9296 1057.9831 1100.7793 1117.7636 1193.0930 1235.6927 1261.8255 1302.3495 1308.1274 1351.4941 1404.6221 1442.0733 1451.4223 1458.9964 1609.8438 1614.8838 1638.1450 1662.4148 3002.3096 3020.2208 3077.5690 3091.2552 3141.0480 3516.5643 3518.3551 3531.7294
redmass: 1.1974 7.6545 10.6750 6.3131 4.2182 8.7994 7.4157 5.7699 7.4605 4.4179 3.6382 6.4389 4.5580 2.8566 2.7566 2.2706 5.7626 3.8782 3.3833 1.6642 1.4525 1.5900 1.9299 4.1116 6.5094 6.6124 4.5014 4.5374 2.2210 2.2096 1.6849 2.6725 2.3918 2.1088 3.0360 1.5317 1.6510 1.5998 2.5696 3.3207 1.9680 1.1504 1.0915 1.0962 1.0737 7.4097 8.1005 8.5877 8.1155 1.0438 1.0604 1.0987 1.0881 1.1012 1.0640 1.0640 1.0643
irintensity: 1.1464 1.4929 1.0983 0.2485 0.1139 1.5050 3.1425 2.8990 0.5796 3.3306 0.4853 0.6864 6.3037 2.1761 7.3246 13.3021 26.4999 127.3016 50.3380 116.3907 127.3748 70.8191 42.8393 8.8318 53.8822 11.1801 9.0960 0.6728 38.4227 498.9427 36.9383 134.4528 165.2449 195.3623 136.9398 7.6217 1.1974 2.2545 135.8549 17.6086 88.7535 22.0046 64.8941 22.4473 29.2045 77.6330 164.3558 54.8048 221.5019 1.7719 21.9299 33.5648 12.5921 3.1958 56.9887 27.0985 53.4422
temp: 298.150 k
press: 1.00000 atm
elementType: 8 8 8 8 8 8 6 6 6 6 6 6 6 1 1 1 1 1 1 1 1
symmnumber: 1
zpe: 387222.3 jmol-1
zpe.correction: 0.147485 hartree
zpe.thermalcorrener: 0.160375 hartree
zpe.thermalcorrenthalpy: 0.161320 hartree
zpe.thermalcorrgfe: 0.106082 hartree
zpe.sumelectzpe: -721.912087 hartree
zpe.sumelectthermal: -721.899196 hartree
zpe.sumelectthermalent: -721.898252 hartree
zpe.sumelectthermalfe: -721.953490 hartree
dipole: -0.4654 -0.4773 -1.1204
dipole: 1.3037
quadrupole: -57.8453 -75.9492 -79.4506
quadrupole: 3.4909 -1.8703 -7.9100
quadrupole: 13.2364 -4.8675 -8.3689 3.4909 -1.8703 -7.9100
hfenergy: -722.0595717 hartree
pointgroup: C01 [X(C7H8O6)]
dipole: 0.2026852 -0.111464 0.457797 debye
dipolederiv: -1.0950195 0.1914945 0.3702892 0.2536589 -0.4311938 -0.2146243 0.3690545 -0.2142159 -0.5376989 -0.9566679 -0.3522861 0.4379088 -0.3810116 -0.6414041 0.2464082 0.3409132 0.1891874 -0.4750181 -1.1878821 0.2122807 0.3302541 0.287083 -0.3525414 -0.1806887 0.4123108 -0.180326 -0.5325811 -0.5334264 0.0704424 0.1241264 -0.0030547 -0.7971378 0.27847 0.1980229 0.22449 -0.5439348 -0.6188544 -0.1051479 -0.1386324 -0.2137578 -0.4332956 0.0959714 0.0101772 0.1896309 -0.9082654 -0.6572538 0.0711542 0.1081825 0.0387164 -0.8319544 0.3032443 0.2032798 0.2243228 -0.5455619 -0.0129048 0.1312097 0.0145874 0.4267709 -0.1999752 -0.0410257 -0.1495902 0.0576018 -0.0356157 -0.4052618 -0.0637288 -0.0947131 0.1014773 -0.0330526 0.067284 -0.1928196 -0.0283527 -0.1561085 -0.0221114 0.2216711 -0.0851072 0.4602891 -0.2023267 -0.0750748 -0.2962757 0.0737376 0.0470913 -0.0914455 -0.0546014 0.0876717 -0.1049126 -0.0781179 0.0872013 0.2832917 -0.0010419 -0.0530286 1.3310245 -0.3940294 -0.5237539 -0.5871507 1.1552082 -0.1675754 -0.4273407 -0.2074532 0.7022575 1.4086437 0.5334213 -0.0716931 0.5931598 0.6030167 -0.3253892 -0.0193452 -0.31655 1.221538 1.4256094 -0.4201372 -0.4851587 -0.637675 1.1487032 -0.2008843 -0.4980348 -0.2260253 0.6738782 0.0483412 -0.008311 0.0571835 -0.0667296 0.1224814 -0.0596172 0.0405614 -0.0407477 0.0568732 0.2502985 -0.0021185 -0.0292692 -0.1226273 0.0400154 0.0068039 0.009937 -0.0080934 0.1419307 0.0985481 0.0606933 0.0226262 -0.000591 -0.0438054 -0.030923 -0.0035788 -0.0363926 0.0989673 0.0684011 -0.0086049 -0.0166831 -0.0526685 0.1146819 -0.0264593 -0.0067549 -0.0179275 -0.0482458 -0.073031 0.0005166 -0.0441652 0.0276637 0.1183824 0.0267384 -0.0910458 0.0239254 0.0933441 0.3622602 -0.0183903 0.016062 -0.0030474 0.2045806 0.1040839 -0.0185273 0.1655104 0.3030235 0.2657797 -0.033843 -0.1056429 -0.0042047 0.3691843 0.0026487 -0.1407969 -0.0155541 0.1694751 0.394952 -0.0316852 0.025927 -0.0113882 0.1685508 0.1034081 -0.0234386 0.144274 0.3276801 unknown
polarizability: 125.269846|-11.6484932|96.569796|-14.9875934|-13.5819871|73.5797008 unknown
InChI: InChI=1S/C7H8O6/c1-3(6(10)11)4(7(12)13)2-5(8)9/h8,10,12H,2H2,1H3
charge 0 multiplicity 1
21 atoms
O  -1.623833 2.069155 0.633311
O  -2.997079 -1.493171 0.797229
O  3.210642 -1.375056 -0.454166
O  -0.014524 2.665964 -0.918804
O  -2.17355 -0.533128 -1.149645
O  1.563427 -2.056907 1.005318
C  0.131266 0.485602 0.261838
C  -0.838262 -0.464224 0.944892
C  1.448581 0.202838 -0.049619
C  2.408592 1.174904 -0.708949
C  -0.448062 1.823555 -0.097753
C  -2.030531 -0.794199 0.064239
C  2.017046 -1.160637 0.247617
H  -1.226554 -0.010665 1.874271
H  -0.34023 -1.404919 1.23144
H  2.145856 2.21961 -0.493932
H  2.369395 1.061065 -1.808859
H  3.44332 0.965678 -0.398986
H  -2.007695 2.937346 0.336477
H  -3.756493 -1.724351 0.196379
H  3.542688 -2.28926 -0.240699
