program: Gaussian 09
title: 000079493
version: EM64L-G09RevD.01
frameworkgroup: C1[X(C12H12N2O3)]
method: RPBEPBE
basis: SDD
operation: Freq
keyword: #p
keyword: freq=noraman
keyword: PBEPBE/SDD
title: #p freq=noraman PBEPBE/SDD
converged: YES YES NO NO
title: Mulliken charges:
elementType: O O O N N C C C C C C C C C C C C H H H H H H H H H H H H
charge: -0.244476 -0.226007 -0.275309 -0.265299 -0.029493 0.175111 0.454029 0.234291 -0.463039 -0.124863 -0.002418 -0.327491 -0.382635 -0.788036 0.208105 -0.226574 -0.669439 0.278426 0.298118 0.241706 0.286332 0.242032 0.241942 0.238750 0.227251 0.227287 0.204522 0.233353 0.233823
chargesum: 0.00000
title: Mulliken charges with hydrogens summed into heavy atoms:
elementType: O O O N N C C C C C C C C C C C C
charge: -0.244476 -0.226007 -0.275309 -0.265299 -0.029493 0.175111 0.454029 0.234291 -0.184612 0.173255 -0.002418 -0.085785 -0.096303 -0.065312 0.208105 0.227963 0.002259
polarizability: 2.75766063e+02 1.39789111e+01 1.62579520e+02 -2.37396758e-01 2.05383308e-01 7.42118034e+01
1716.lowfreq: -9.7702 -7.7697 -4.1760 -0.0007 -0.0005 -0.0001 14.5670 46.5635 59.3771
frequency: 12.6925 46.5281 59.3668 78.4141 88.9154 94.9554 115.3132 186.0381 194.6492 235.8749 255.9636 262.1696 283.4957 322.2006 345.7712 364.2975 405.0537 429.2373 469.1114 479.2247 517.0186 567.7302 596.4249 625.2794 672.2082 706.6577 729.7359 733.0677 782.9117 798.4314 803.2897 822.9119 832.7459 885.0828 906.4450 932.2059 979.2028 985.5418 998.6244 1018.7759 1027.5142 1049.2181 1088.0855 1112.8423 1128.3429 1132.8641 1156.0909 1229.7881 1245.4997 1275.1715 1276.5659 1306.1660 1336.9164 1359.6994 1375.8595 1398.6672 1399.8963 1452.3160 1457.3909 1459.9353 1465.8460 1471.7994 1481.3306 1485.6972 1494.7466 1553.6771 1581.9716 1641.5167 1671.1865 2983.3385 2996.1470 3006.9990 3060.7726 3065.6785 3092.9829 3103.3377 3110.0431 3153.3430 3161.9123 3180.0523 3186.3611
redmass: 4.4577 3.1446 4.9306 3.9532 1.1906 3.3787 2.4069 3.2843 4.4305 1.3945 4.8736 4.4749 5.1944 6.1408 4.8331 5.2436 5.5734 3.0801 5.5650 3.4076 6.9799 7.2070 7.4743 3.9540 7.2769 7.1692 6.6785 6.0592 5.6183 1.1168 6.7249 4.1933 1.3386 6.2289 1.3934 3.2453 1.4214 1.3189 1.7880 2.3194 3.8343 1.5786 7.9698 2.2304 2.0207 1.4582 1.8826 1.8991 1.1402 1.7110 3.3657 3.0850 1.8840 1.6989 4.4614 1.2755 1.2346 2.2221 1.8870 1.0400 1.0449 1.0881 3.9254 1.0743 2.3839 6.4463 10.9250 6.7027 11.0198 1.0381 1.0362 1.0577 1.0970 1.1068 1.0985 1.0989 1.1021 1.0922 1.0891 1.0932 1.0977
irintensity: 1.8574 1.9011 0.3258 2.3108 0.0449 2.1963 0.7808 2.7306 0.4987 0.0001 6.0480 4.9734 0.9200 1.8996 14.3843 0.9599 2.7989 12.8261 1.0913 3.2363 3.8528 6.2876 5.3591 2.0850 0.1726 3.8013 5.9308 7.4021 27.4204 1.9045 1.2229 2.0541 38.2381 32.4602 6.9712 7.5231 7.6397 4.3437 1.5760 51.5144 13.7591 14.8978 409.5892 3.2291 17.8663 5.7232 14.2995 93.0642 0.0037 131.9705 197.7411 20.5176 63.1508 0.0904 8.5688 24.9527 22.9053 11.1518 18.1935 11.4344 16.0912 40.8196 646.6531 22.3524 102.2268 41.9604 160.5115 152.4039 310.3164 18.4467 22.7527 24.6628 12.4218 11.8601 33.5888 14.6849 41.2813 0.3186 5.5265 0.0530 10.5269
temp: 298.150 k
press: 1.00000 atm
elementType: 8 8 8 7 7 6 6 6 6 6 6 6 6 6 6 6 6 1 1 1 1 1 1 1 1 1 1 1 1
symmnumber: 1
zpe: 579238.6 jmol-1
zpe.correction: 0.220620 hartree
zpe.thermalcorrener: 0.236400 hartree
zpe.thermalcorrenthalpy: 0.237344 hartree
zpe.thermalcorrgfe: 0.175424 hartree
zpe.sumelectzpe: -798.442318 hartree
zpe.sumelectthermal: -798.426538 hartree
zpe.sumelectthermalent: -798.425594 hartree
zpe.sumelectthermalfe: -798.487515 hartree
dipole: -5.2156 -2.6245 0.0331
dipole: 5.8388
quadrupole: -66.5059 -107.1812 -99.1580
quadrupole: 1.1100 0.0810 0.0423
quadrupole: 24.4425 -16.2328 -8.2096 1.1100 0.0810 0.0423
hfenergy: -798.6629383 hartree
pointgroup: C01 [X(C12H12N2O3)]
dipole: 2.0745419 -0.9864009 0.015994 debye
polarizability: 276.2699274|-11.4552645|162.0064556|3.5697234|0.5774306|74.281004 unknown
InChI: InChI=1S/C12H12N2O3/c1-3-17-12(16)9-7-13-10-6-8(2)4-5-14(10)11(9)15/h4-7H,3H2,1-2H3
charge 0 multiplicity 1
29 atoms
O  -3.20246 -0.471927 -0.171642
O  -0.768487 -1.826281 -0.118867
O  -3.147479 1.854658 -0.124428
N  1.149967 -0.445404 -0.078413
N  1.014621 1.978147 -0.06527
C  1.751751 0.831369 -0.06037
C  3.974855 -0.255045 -0.030416
C  -0.353777 -0.639895 -0.105312
C  3.180507 0.893823 -0.036563
C  1.925312 -1.597703 -0.072132
C  -1.058469 0.624655 -0.109298
C  3.306493 -1.53037 -0.048698
C  -0.33755 1.84332 -0.088602
C  5.485147 -0.187549 -0.00596
C  -2.54087 0.747416 -0.134159
C  -4.695857 -0.395724 -0.198757
C  -5.198329 -1.834716 -0.246815
H  3.609589 1.898762 -0.023485
H  1.345334 -2.524019 -0.08731
H  3.882774 -2.460081 -0.044429
H  -0.91983 2.77087 -0.092016
H  5.916243 -0.690034 -0.892127
H  5.888334 -0.70443 0.885004
H  5.847256 0.852993 0.007978
H  -5.03383 0.145391 0.703924
H  -4.999144 0.193269 -1.08362
H  -6.303608 -1.845566 -0.268074
H  -4.824128 -2.350212 -1.147381
H  -4.857865 -2.398219 0.638239
