program: Gaussian 09
title: 000079507
version: EM64L-G09RevD.01
frameworkgroup: C1[X(C13H24O2)]
method: RPBEPBE
basis: SDD
operation: Freq
keyword: #pfreq=noraman
keyword: PBEPBE/SDD
title: #p freq=noraman PBEPBE/SDD
converged: YES YES NO NO
title: Mulliken charges:
elementType: O O C C C C C C C C C C C C C H H H H H H H H H H H H H H H H H H H H H H H H
charge: -0.277041 -0.254523 0.009059 0.404031 -0.493577 -0.494785 -0.479183 -0.464866 0.051150 -0.430780 -0.787257 -0.783445 -0.742078 0.281444 -0.761307 0.174546 0.205196 0.221534 0.219808 0.208569 0.209798 0.211261 0.232833 0.203203 0.237227 0.208193 0.206389 0.216073 0.216607 0.210949 0.214877 0.216813 0.210662 0.223985 0.214571 0.224502 0.246259 0.245746 0.243557
chargesum: 0.00000
title: Mulliken charges with hydrogens summed into heavy atoms:
elementType: O O C C C C C C C C C C C C C
charge: -0.277041 -0.254523 0.183605 0.404031 -0.066847 -0.066408 -0.058124 -0.028830 0.288376 -0.016198 -0.143627 -0.141092 -0.079021 0.281444 -0.025745
polarizability: 1.83154901e+02 1.89154201e-01 1.31058618e+02 -1.51054723e+00 1.91689568e+00 1.21639497e+02
1716.lowfreq: -26.9915 -20.1905 -6.4246 -0.0007 -0.0006 0.0007 10.7515 30.4987 37.7982
frequency: -26.9191 30.1619 36.7581 49.7384 70.0855 92.6370 129.0241 167.3407 186.2977 199.3781 213.8561 229.9829 253.4049 264.7656 268.9521 309.3473 322.2800 343.7742 367.0859 389.3683 433.5703 439.6677 461.5406 465.7178 503.8138 569.1861 583.8208 627.0004 714.0100 777.5104 785.7525 789.3534 842.9869 863.4984 897.9828 903.5013 926.5580 930.2108 942.8313 962.3764 977.8949 997.9117 1004.5781 1026.0336 1036.5142 1040.7422 1042.8295 1058.1241 1061.1133 1101.9983 1116.2223 1151.3550 1188.5913 1200.6004 1203.2133 1208.0314 1219.4153 1244.3416 1258.2583 1289.2114 1298.7827 1301.4370 1304.6058 1314.2089 1331.6874 1333.7815 1345.6579 1351.4856 1365.9496 1375.0739 1382.0130 1384.0532 1396.8221 1453.1503 1454.7330 1457.6126 1462.0334 1462.5761 1466.1838 1469.2278 1470.6876 1476.7041 1485.7299 1489.4404 1492.5695 1495.7460 1643.3987 2918.5881 2968.1865 2968.9450 2973.4409 2974.5800 2982.2729 2983.1585 2984.4813 2987.0036 3006.7870 3010.7329 3023.3393 3043.8023 3049.3605 3052.6723 3059.0439 3061.0497 3063.8521 3068.8747 3070.0987 3076.7867 3083.0915 3095.3186 3141.0229
redmass: 1.0716 2.7835 3.1902 5.0461 2.5843 2.5297 3.6974 1.5570 3.3851 1.6442 1.8541 1.8449 2.0810 1.2507 1.5579 2.7423 2.5028 3.0568 2.9350 2.1020 2.5575 2.0452 2.7125 2.7598 3.0604 3.1023 2.8605 4.3330 2.8889 1.1902 1.8700 1.8403 4.6627 2.2287 1.8998 1.3430 1.5077 2.1497 3.5036 2.0828 1.3392 1.8672 2.2957 1.8360 1.5289 1.6630 2.1582 1.1051 2.0905 2.6335 1.9629 2.0749 2.1245 2.3805 2.2631 3.2738 1.3494 1.4344 1.4034 1.4676 1.2414 1.2604 1.3562 1.2701 1.5135 1.4236 1.4393 1.6005 1.4649 1.2085 1.2666 1.2156 1.1975 1.0645 1.0476 1.0761 1.0890 1.0654 1.0623 1.0778 1.0472 1.0977 1.0750 1.0471 1.0489 1.0584 9.1523 1.0821 1.0567 1.0365 1.0432 1.0590 1.0526 1.0457 1.0605 1.0633 1.0367 1.0830 1.0998 1.0967 1.0980 1.1021 1.0987 1.1024 1.0980 1.0987 1.0991 1.0974 1.0997 1.0973 1.1011
irintensity: 1.1427 0.2979 0.1927 1.1517 1.0493 1.3268 2.4582 0.2706 2.0933 0.3709 0.8449 0.4320 2.6926 0.3136 0.6256 1.8783 0.3556 3.6271 3.4966 0.6063 0.0782 3.1704 0.1701 0.3245 2.4674 3.0887 0.8822 6.5300 1.6598 5.8034 0.5732 0.6833 10.4749 6.7443 0.5494 11.9053 1.0869 8.5041 33.1157 8.1719 3.7181 68.4400 132.6804 13.2278 0.2939 8.5025 1.3240 0.3828 3.6343 1.0343 0.7104 3.2080 10.7878 17.4606 23.3892 345.3905 7.5782 0.5434 1.9635 1.0788 0.3445 0.8674 8.6243 0.1572 4.8656 1.4352 0.8511 1.5496 15.6434 21.3833 49.8642 11.8320 22.6774 26.8556 18.2932 6.8241 8.6830 0.5614 0.2199 18.3643 5.7105 3.8805 13.4431 4.2071 10.4832 13.5329 178.2857 22.1067 46.4258 26.5938 29.1725 16.3862 11.2241 49.0093 16.8139 23.6158 3.0715 17.8953 22.3023 46.1240 14.1956 24.4584 2.7246 49.6814 110.6792 13.9316 39.0769 76.3505 51.2388 9.0685 12.3171
temp: 298.150 k
press: 1.00000 atm
elementType: 8 8 6 6 6 6 6 6 6 6 6 6 6 6 6 1 1 1 1 1 1 1 1 1 1 1 1 1 1 1 1 1 1 1 1 1 1 1 1
symmnumber: 1
zpe: 907271.5 jmol-1
zpe.correction: 0.345561 hartree
zpe.thermalcorrener: 0.362480 hartree
zpe.thermalcorrenthalpy: 0.363424 hartree
zpe.thermalcorrgfe: 0.300673 hartree
zpe.sumelectzpe: -659.021422 hartree
zpe.sumelectthermal: -659.004503 hartree
zpe.sumelectthermalent: -659.003559 hartree
zpe.sumelectthermalfe: -659.066311 hartree
dipole: 1.0406 1.6357 0.8745
dipole: 2.1268
quadrupole: -92.1623 -98.5034 -93.8850
quadrupole: -7.0708 -4.3205 -2.8589
quadrupole: 2.6879 -3.6532 0.9653 -7.0708 -4.3205 -2.8589
hfenergy: -659.3669836 hartree
pointgroup: C01 [X(C13H24O2)]
dipole: -0.4292393 -0.5842156 0.4178302 debye
polarizability: 183.0561415|-0.4500383|130.3790269|2.8053394|-3.1396213|122.4178474 unknown
InChI: InChI=1S/C13H24O2/c1-5-13(3,4)11-6-8-12(9-7-11)15-10(2)14/h11-12H,5-9H2,1-4H3
charge 0 multiplicity 1
39 atoms
O  3.045488 -0.590056 0.30755
O  3.898276 1.270928 -0.819997
C  -1.276145 -0.243492 0.517126
C  -2.828719 -0.018279 0.312852
C  -0.636475 -1.245713 -0.485902
C  -0.434536 1.064289 0.524951
C  0.84875 -1.531927 -0.147378
C  1.051042 0.788022 0.870482
C  1.649603 -0.226112 -0.1173
C  -3.122907 0.62782 -1.080419
C  -3.556473 -1.389028 0.433082
C  -3.357288 0.902466 1.450681
C  -4.613098 0.881534 -1.404581
C  4.078076 0.253753 -0.110343
C  5.408669 -0.246395 0.41307
H  -1.173438 -0.696901 1.530702
H  -0.699762 -0.836889 -1.514719
H  -1.188387 -2.20283 -0.486848
H  -0.839146 1.78622 1.256998
H  -0.488672 1.551534 -0.469487
H  0.922078 -2.018784 0.84505
H  1.288853 -2.226318 -0.887308
H  1.633292 1.727012 0.842781
H  1.125845 0.371425 1.894812
H  1.71501 0.228325 -1.125271
H  -2.582331 1.592853 -1.146729
H  -2.701667 -0.022909 -1.872545
H  -4.650293 -1.252804 0.509408
H  -3.364534 -2.039257 -0.439733
H  -3.225481 -1.929222 1.341122
H  -4.461862 0.925452 1.461326
H  -3.005513 1.944247 1.339427
H  -3.023466 0.533539 2.439813
H  -5.082317 1.566804 -0.675779
H  -4.714545 1.343247 -2.404448
H  -5.196375 -0.056673 -1.413455
H  5.576143 -1.289709 0.094933
H  5.407925 -0.236454 1.51712
H  6.219682 0.394181 0.037855
