program: Gaussian 09
title: 000079420
version: EM64L-G09RevD.01
frameworkgroup: C1[X(C14H18O)]
method: RPBEPBE
basis: SDD
operation: Freq
keyword: #pfreq=noraman
keyword: PBEPBE/SDD
title: #p freq=noraman PBEPBE/SDD
converged: YES YES NO NO
title: Mulliken charges:
elementType: O C C C C C C C C C C C C C C H H H H H H H H H H H H H H H H H H
charge: -0.224768 0.306182 -0.612018 -0.541467 0.438097 -0.042442 -0.729621 -0.743297 0.032503 0.385949 -0.629776 0.478237 -0.622300 -0.797444 -0.814135 0.224726 0.223931 0.245089 0.230947 0.215006 0.237463 0.208264 0.209457 0.221010 0.215043 0.243571 0.239897 0.251057 0.208814 0.248091 0.228650 0.238909 0.226376
chargesum: 0.00000
title: Mulliken charges with hydrogens summed into heavy atoms:
elementType: O C C C C C C C C C C C C C C
charge: -0.224768 0.306182 -0.163362 -0.065430 0.438097 -0.042442 -0.068889 -0.097787 0.032503 0.385949 -0.386205 0.478237 -0.382403 -0.089483 -0.120199
polarizability: 1.94661287e+02 -7.78739336e+00 1.70231904e+02 6.92117625e+00 2.80059252e+00 9.76721544e+01
1716.lowfreq: -0.0009 -0.0008 -0.0007 2.8327 11.3668 15.2031 30.8295 47.7610 67.6255
frequency: 30.0255 47.7435 67.5635 103.7905 182.9782 190.6029 204.4819 207.8510 231.5502 238.4953 263.4944 287.4050 293.9046 319.3383 334.2317 368.2670 385.2092 434.1499 463.9987 486.6242 526.6312 537.3787 538.8355 577.1976 619.2056 664.1480 677.7332 744.8633 806.2498 860.8020 890.1360 907.7104 914.2187 931.9640 935.8613 948.8350 974.2690 988.3231 1007.9508 1022.5760 1034.1163 1040.8536 1047.5242 1054.8008 1124.2488 1149.7874 1168.2281 1182.9618 1237.9239 1259.7963 1274.6924 1279.5758 1301.2981 1305.9720 1337.8629 1368.8996 1376.8165 1395.2995 1395.5815 1400.2657 1414.7674 1428.6758 1445.3088 1449.8635 1453.6866 1462.8334 1469.6428 1469.9995 1473.8044 1476.4526 1481.3295 1485.6688 1554.6604 1587.9841 1617.1513 2945.5296 2956.2761 2964.6204 2975.2438 2975.9413 2988.0355 3016.6535 3052.6053 3057.7227 3059.8750 3064.2269 3069.8115 3077.3386 3078.0608 3085.4238 3087.7716 3112.0103 3119.1534
redmass: 1.0215 3.6975 3.2163 3.5600 2.7050 1.2532 2.1170 1.7801 1.3184 1.3136 1.8102 4.0830 2.8409 2.5235 4.4955 2.4553 2.6028 3.1801 3.3492 3.3510 3.3507 3.7476 3.8975 4.0961 3.1685 4.7319 3.7499 3.3613 3.3491 1.3785 1.4228 1.8175 1.8300 1.9955 1.4394 2.4347 2.4825 2.1585 1.4198 1.5664 2.4838 1.5704 1.6651 2.7424 1.5940 1.4482 1.9282 1.4722 1.6856 2.6745 2.7228 1.4844 1.9969 3.6751 2.3531 4.8007 1.2055 1.2189 1.2217 1.5128 1.7841 1.1141 1.3770 1.0517 1.3780 1.0533 1.1093 1.3006 1.0641 1.3224 1.0650 1.0634 6.7509 8.0933 6.0406 1.0639 1.0642 1.0357 1.0365 1.0388 1.0367 1.0952 1.0946 1.0944 1.0994 1.0995 1.0987 1.0954 1.0990 1.1010 1.1000 1.0911 1.0916
irintensity: 0.4557 2.6951 0.2866 0.1489 5.1853 0.2454 0.2162 0.4927 0.4487 0.7997 0.8028 0.1104 1.4563 0.9615 2.6035 0.2713 0.2810 1.6494 3.5312 2.7015 0.1855 2.6285 1.7103 5.1368 3.7475 0.1985 10.0961 2.6881 0.7841 15.0680 3.9882 0.4603 1.5421 3.4741 0.8819 8.9860 1.5429 8.5284 0.7190 0.9050 1.8571 3.0776 22.7049 9.9567 7.8533 7.1305 2.4766 7.9812 16.8492 40.9933 82.1996 7.1144 5.0017 16.1891 5.0405 17.5858 20.9531 13.8417 22.9176 13.1377 9.0138 15.8895 6.6319 12.8897 23.8682 2.0959 10.9620 23.8616 13.0037 18.0156 4.8278 9.7540 102.4417 157.0525 77.6587 23.9693 18.6710 43.9259 24.1728 27.0500 25.4873 20.3423 9.1432 20.6067 31.2894 16.5556 57.2121 8.6246 45.8013 24.4418 16.8514 22.3274 21.4815
temp: 298.150 k
press: 1.00000 atm
elementType: 8 6 6 6 6 6 6 6 6 6 6 6 6 6 6 1 1 1 1 1 1 1 1 1 1 1 1 1 1 1 1 1 1
symmnumber: 1
zpe: 735172.4 jmol-1
zpe.correction: 0.280012 hartree
zpe.thermalcorrener: 0.295170 hartree
zpe.thermalcorrenthalpy: 0.296114 hartree
zpe.thermalcorrgfe: 0.238038 hartree
zpe.sumelectzpe: -618.418961 hartree
zpe.sumelectthermal: -618.403804 hartree
zpe.sumelectthermalent: -618.402860 hartree
zpe.sumelectthermalfe: -618.460936 hartree
dipole: 0.7844 -3.6650 -0.2024
dipole: 3.7534
quadrupole: -80.5258 -95.9479 -91.5371
quadrupole: 2.6334 1.5044 0.2227
quadrupole: 8.8111 -6.6109 -2.2002 2.6334 1.5044 0.2227
hfenergy: -618.6989735 hartree
pointgroup: C01 [X(C14H18O1)]
dipole: 0.3357356 1.4344726 0.1012396 debye
polarizability: 194.9096854|7.4423263|169.8404475|-6.9914716|4.039174|97.8152126 unknown
InChI: InChI=1S/C14H18O/c1-9-5-10(2)13-11(6-9)7-14(3,4)8-12(13)15/h5-6H,7-8H2,1-4H3
charge 0 multiplicity 1
33 atoms
O  -0.989498 -2.709109 0.005295
C  -2.428524 0.696797 -0.084538
C  -1.218997 1.483599 0.486379
C  -2.323263 -0.746609 0.474133
C  0.127433 0.810389 0.250563
C  0.243325 -0.613712 0.122922
C  -2.399216 0.684582 -1.635162
C  -3.748658 1.346436 0.395387
C  -0.995432 -1.449379 0.175811
C  1.543865 -1.203549 -0.061571
C  1.282984 1.616958 0.181924
C  2.569222 1.056123 0.003337
C  2.672111 -0.352164 -0.10865
C  1.773219 -2.696607 -0.202196
C  3.80063 1.936979 -0.095107
H  -1.371381 1.600991 1.5815
H  -1.198196 2.507764 0.065947
H  -3.133652 -1.393637 0.092523
H  -2.432947 -0.709891 1.580049
H  -3.239821 0.087094 -2.034449
H  -1.461347 0.253338 -2.028261
H  -2.493036 1.712523 -2.032953
H  -3.810241 1.366145 1.500386
H  -4.623848 0.786247 0.016425
H  -3.832349 2.387965 0.03053
H  1.178128 2.705894 0.270765
H  3.663349 -0.803677 -0.241283
H  1.244485 -3.106513 -1.080136
H  2.852738 -2.90952 -0.297526
H  1.368067 -3.255177 0.659253
H  4.696923 1.425283 0.297194
H  4.011282 2.203011 -1.149547
H  3.670244 2.881327 0.461656
