program: Gaussian 09
title: 000079431
version: EM64L-G09RevD.01
frameworkgroup: C1[X(C10H16N10OS2)]
method: RPBEPBE
basis: SDD
operation: Freq
keyword: #p
keyword: freq=noraman
keyword: PBEPBE/SDD
title: #p freq=noraman PBEPBE/SDD
converged: YES YES NO NO
title: Mulliken charges:
elementType: S S O N N N N N N N N N N C C C C C C C C C C H H H H H H H H H H H H H H H H
charge: 0.186129 0.246581 -0.210314 -0.053281 -0.049535 -0.076747 -0.153833 -0.127612 -0.133851 -0.586455 -0.585273 -0.586472 -0.588593 -0.645665 -0.656231 -0.591840 -0.227541 -0.264491 0.111060 0.050100 0.065495 0.038635 0.082169 0.261369 0.257420 0.274285 0.241367 0.288049 0.283085 0.229175 0.240717 0.333603 0.338064 0.336970 0.334826 0.339275 0.332108 0.334454 0.332795
chargesum: 0.00000
title: Mulliken charges with hydrogens summed into heavy atoms:
elementType: S S O N N N N N N N N N N C C C C C C C C C C
charge: 0.186129 0.246581 -0.210314 -0.053281 -0.049535 -0.076747 -0.153833 -0.127612 -0.133851 0.085212 0.086524 0.084911 0.078657 -0.126876 -0.140579 -0.020706 0.242351 -0.264491 0.111060 0.050100 0.065495 0.038635 0.082169
polarizability: 3.53405395e+02 1.07835432e+01 2.31409905e+02 9.04879391e+00 -1.08336372e+01 1.34262706e+02
1716.lowfreq: -7.5142 -3.4751 0.0006 0.0017 0.0019 1.6861 6.7224 10.1494 16.0225
frequency: -4.3408 9.4332 15.8445 19.5094 36.2214 46.5538 59.2262 91.1574 96.1290 105.7301 127.5494 150.4240 181.1146 181.5446 186.0465 191.3159 192.3984 224.5104 244.7602 254.2593 308.3974 313.4534 329.2783 357.3614 409.1938 429.8647 475.5694 482.2096 489.8662 491.4893 496.1076 512.3093 542.0570 546.1196 549.5249 551.8533 552.7126 554.1891 593.2409 603.8240 631.0070 642.7098 657.8137 669.8834 703.9326 709.8525 710.3783 745.6449 775.3315 794.3058 796.0612 827.2603 865.0045 894.6756 901.3333 923.1593 947.6067 957.0730 977.0047 985.7352 1012.6301 1018.9857 1055.4832 1070.0411 1109.2713 1125.3997 1128.2881 1128.4375 1174.8614 1213.6147 1231.9082 1257.3414 1257.5833 1268.7448 1275.2091 1281.6142 1305.7632 1318.1035 1384.3578 1408.0750 1425.4267 1435.4249 1448.0175 1457.2704 1460.7936 1465.4717 1484.2156 1510.9111 1516.9056 1518.6610 1528.2827 1597.6915 1598.0035 1626.6892 1629.6817 3001.1586 3009.2422 3022.0487 3053.3738 3074.6002 3079.2643 3098.7674 3133.1896 3554.5825 3556.3674 3556.4948 3558.7626 3715.1227 3716.0174 3717.2577 3718.4035
redmass: 6.6109 6.6582 6.9478 4.8376 6.8021 6.0652 2.2448 8.3857 5.6043 4.1245 4.0153 10.1660 5.1763 7.8869 7.3388 5.4547 6.4979 7.1647 5.2303 2.5034 3.2540 2.8619 3.7645 3.6502 4.4564 7.1862 1.2000 1.1939 3.2780 1.2205 1.2264 3.5076 1.0537 1.0796 1.0296 1.0476 8.0483 8.3496 6.4968 6.9322 4.4500 8.5907 9.2524 4.4286 9.9926 11.4477 11.4873 4.8377 1.1151 12.4554 12.4095 2.9415 5.8744 11.3998 7.2659 2.3031 2.3269 1.3357 3.8063 1.5894 2.1180 3.5849 3.5435 2.5116 1.0429 3.8035 2.4419 2.4564 1.1656 1.2080 1.2067 1.2443 5.0162 2.4413 6.0674 1.6489 1.3966 2.0390 2.2810 5.1687 4.6435 1.1190 1.0920 1.2095 1.1040 5.1595 3.7448 2.0442 2.0002 4.3188 4.5040 1.4639 1.4834 2.0335 2.1604 1.0583 1.0562 1.0586 1.0570 1.1053 1.1081 1.1064 1.1090 1.0440 1.0441 1.0445 1.0444 1.1059 1.1059 1.1059 1.1058
irintensity: 1.6029 0.2212 0.3282 0.2913 0.5164 0.9089 0.2034 1.3377 7.6297 4.2285 3.5446 0.6241 1.1875 0.0167 5.8646 13.9993 4.2465 2.6856 0.3282 1.6156 6.0564 5.7517 20.9941 2.5202 12.6089 0.3050 57.9806 18.2898 4.2798 464.7588 645.9581 1.6487 13.8047 2.1240 0.5940 2.5458 3.9194 6.4445 0.2882 11.6314 5.3638 7.0923 24.7288 12.1135 0.0232 0.0534 0.0449 0.7859 8.9056 42.8227 33.8783 2.9277 54.0890 0.0892 17.9983 3.4628 66.4621 1.0775 1.5443 8.2342 42.8774 9.5459 7.9097 8.3998 1.2735 151.8326 0.0562 7.3118 0.1193 5.6586 64.4016 2.5251 16.5019 177.0326 25.9629 327.3412 53.0810 457.7045 147.9344 0.2904 3.2615 15.5710 25.6037 145.3659 30.1233 564.5629 491.2898 122.9300 121.0001 569.3609 639.7049 411.5330 943.1851 314.5372 183.7649 11.1177 19.7826 29.9474 4.2861 8.0395 17.3522 19.6799 10.1343 149.8591 135.0217 87.8375 65.4871 43.3278 57.5306 45.1547 53.9863
temp: 298.150 k
press: 1.00000 atm
elementType: 16 16 8 7 7 7 7 7 7 7 7 7 7 6 6 6 6 6 6 6 6 6 6 1 1 1 1 1 1 1 1 1 1 1 1 1 1 1 1
symmnumber: 1
zpe: 768073.9 jmol-1
zpe.correction: 0.292544 hartree
zpe.thermalcorrener: 0.315668 hartree
zpe.thermalcorrenthalpy: 0.316612 hartree
zpe.thermalcorrgfe: 0.235538 hartree
zpe.sumelectzpe: -1807.859998 hartree
zpe.sumelectthermal: -1807.836874 hartree
zpe.sumelectthermalent: -1807.835930 hartree
zpe.sumelectthermalfe: -1807.917004 hartree
dipole: 1.2405 0.7941 1.8126
dipole: 2.3355
quadrupole: -89.9769 -124.3748 -147.8041
quadrupole: -11.1271 7.3090 -3.3753
quadrupole: 30.7417 -3.6562 -27.0855 -11.1271 7.3090 -3.3753
hfenergy: -1808.152542 hartree
pointgroup: C01 [X(C10H16N10O1S2)]
dipole: 0.4780674 0.2648558 0.7386706 debye
polarizability: 352.8987341|11.9051483|232.8180793|11.6910448|-3.1344608|133.3611936 unknown
InChI: InChI=1S/C10H16N10OS2/c11-5-15-6(12)18-9(17-5)21-1-2-22-3-4-23-10-19-7(13)16-8(14)20-10/h1-4,11-14H2
charge 0 multiplicity 1
39 atoms
S  0.441869 -0.608953 -0.303797
S  -3.913618 -1.80482 -0.367328
O  3.569538 -0.418699 -0.743869
N  -6.461382 -1.0068 -0.093106
N  -4.788897 0.727317 0.231007
N  5.21642 1.187916 -0.750908
N  5.437186 -0.797987 0.640968
N  -7.163741 1.275209 0.441772
N  7.199888 0.894053 0.657242
N  -8.724486 -0.443458 0.117655
N  -5.502303 2.900098 0.740185
N  6.927346 2.78051 -0.706331
N  7.351038 -1.039462 1.970617
C  -1.136054 -1.652306 -0.499073
C  1.687607 -1.91672 -0.888144
C  -2.337448 -0.754674 -0.196338
C  3.045261 -1.711261 -0.231361
C  -5.181893 -0.546709 -0.038553
C  4.789906 -0.00306 -0.257183
C  -7.415295 -0.043981 0.15753
C  -5.833421 1.600382 0.463994
C  6.43539 1.585961 -0.25225
C  6.647683 -0.289426 1.064856
H  -1.172978 -2.029064 -1.535932
H  -1.078416 -2.504182 0.201465
H  1.769667 -1.8689 -1.986348
H  1.29408 -2.904783 -0.589021
H  -2.417621 0.084674 -0.903426
H  -2.313954 -0.355166 0.82925
H  3.749394 -2.518224 -0.509678
H  2.973633 -1.670068 0.869555
H  -9.458214 0.237184 0.295789
H  -8.935334 -1.415739 -0.092156
H  -4.52123 3.166273 0.759904
H  -6.242431 3.574438 0.916404
H  6.378681 3.312829 -1.376766
H  7.82378 3.113488 -0.362157
H  8.246726 -0.696764 2.307609
H  6.960821 -1.920623 2.293418
