program: Gaussian 09
title: 000079409
version: EM64L-G09RevD.01
frameworkgroup: C1[X(C13H18O2)]
method: RPBEPBE
basis: SDD
operation: Freq
keyword: #pfreq=noraman
keyword: PBEPBE/SDD
title: #p freq=noraman PBEPBE/SDD
converged: YES YES NO NO
title: Mulliken charges:
elementType: O O C C C C C C C C C C C C C H H H H H H H H H H H H H H H H H H
charge: -0.255444 -0.255445 0.277835 -0.383502 -0.383547 0.168754 -0.728025 -0.700018 0.366045 -0.724994 -0.378230 -0.378252 -0.232518 -0.232504 -0.239782 0.206259 0.221806 0.221811 0.206283 0.217796 0.217798 0.214057 0.256928 0.202855 0.202854 0.228264 0.242454 0.228271 0.265254 0.265232 0.226526 0.226526 0.228653
chargesum: 0.00000
title: Mulliken charges with hydrogens summed into heavy atoms:
elementType: O O C C C C C C C C C C C C C
charge: -0.255444 -0.255445 0.277835 0.044564 0.044547 0.168754 -0.078374 -0.037381 0.366045 -0.026005 -0.112976 -0.113020 -0.005992 -0.005978 -0.011129
polarizability: 1.64669586e+02 1.41460207e+01 1.19378835e+02 -9.64504655e-03 1.50933827e-02 1.32746259e+02
1716.lowfreq: -0.0011 -0.0006 -0.0005 3.0358 3.3524 11.5772 58.8323 61.0418 112.6255
frequency: 58.5339 61.0057 112.6124 128.2896 167.5068 187.7925 200.8398 206.6228 225.9045 266.6220 270.6357 291.7936 328.4302 352.1983 402.0844 403.5941 413.1542 447.1122 473.6448 487.1904 538.3499 572.2153 616.0063 644.7134 686.5296 713.9718 768.9434 776.0762 799.4729 840.1605 868.9650 900.6807 920.8559 939.4200 940.2312 940.7885 952.1385 987.9172 989.9883 994.2430 1001.2017 1017.9187 1024.5810 1040.7814 1068.7427 1078.8432 1113.3018 1149.4868 1170.3217 1180.2067 1185.8611 1204.2384 1209.4352 1245.2563 1275.2899 1308.5107 1312.6881 1329.8545 1355.0374 1373.6976 1379.6818 1383.7751 1394.2685 1433.2987 1453.9767 1454.2403 1455.9142 1458.4341 1464.5491 1474.3612 1476.8575 1478.5310 1485.6547 1591.1486 1610.1589 2951.5057 2957.0900 2967.7024 2978.8519 3009.3441 3061.1611 3062.4396 3064.6724 3070.5585 3071.7369 3100.5733 3117.7796 3118.6291 3121.7769 3129.9514 3142.6541 3150.2607 3163.2380
redmass: 3.6412 3.9870 2.8869 3.3455 1.0276 1.0242 1.1354 3.9104 3.0935 2.3397 2.9351 3.2500 2.5403 6.4475 2.2470 1.8846 2.5726 3.3069 4.6781 5.6580 3.4308 5.0397 6.4144 4.3000 5.9820 1.7830 2.2318 2.6780 2.8275 2.8631 1.2515 2.0072 2.1252 1.3858 1.3854 1.3417 6.7058 3.7037 5.7754 1.3619 1.3168 1.4373 2.3169 2.3818 1.5851 1.8722 1.7633 3.0411 1.0527 1.1366 2.6692 1.9904 1.3510 4.0481 2.1801 1.3358 1.7859 1.2152 1.3261 1.2204 8.8797 1.2376 1.2070 2.1948 1.0728 1.0764 1.0659 1.0533 1.0483 1.0858 2.0526 1.0814 1.0614 6.3622 6.1001 1.0649 1.0632 1.0370 1.0374 1.0346 1.0991 1.0989 1.0995 1.0992 1.0980 1.0981 1.1004 1.1009 1.0845 1.0877 1.0920 1.0959 1.1014
irintensity: 0.0174 0.6671 0.0469 0.2040 0.0497 0.0856 0.0266 4.3503 0.0026 0.5989 0.5347 5.2110 0.8318 13.2036 0.4020 3.4041 0.2819 2.8242 1.0571 3.7743 5.9893 10.3502 0.0750 9.7057 5.3291 59.4039 31.7605 11.3287 29.9352 20.0445 0.2100 18.0296 4.4818 5.2251 3.1145 5.6322 9.2797 71.9807 2.4003 0.0140 6.2592 1.0616 13.5050 86.4690 19.9872 23.0964 11.6363 111.6956 0.0000 9.6593 6.8985 31.7357 1.5118 48.4538 0.3590 1.9327 2.2847 0.1252 2.7664 18.9165 0.2182 35.3241 15.8045 11.8940 0.8444 11.8843 1.4687 5.2827 0.2990 13.4730 11.8823 7.6511 23.5178 0.1745 0.7598 19.8775 58.4187 51.8223 33.4564 11.4175 13.5688 1.8678 0.0025 63.0889 90.8190 19.5538 12.3098 25.0374 0.2905 4.9064 13.0226 27.4495 23.8430
temp: 298.150 k
press: 1.00000 atm
elementType: 8 8 6 6 6 6 6 6 6 6 6 6 6 6 6 1 1 1 1 1 1 1 1 1 1 1 1 1 1 1 1 1 1
symmnumber: 1
zpe: 734251.5 jmol-1
zpe.correction: 0.279662 hartree
zpe.thermalcorrener: 0.294246 hartree
zpe.thermalcorrenthalpy: 0.295190 hartree
zpe.thermalcorrgfe: 0.239322 hartree
zpe.sumelectzpe: -655.474945 hartree
zpe.sumelectthermal: -655.460361 hartree
zpe.sumelectthermalent: -655.459417 hartree
zpe.sumelectthermalfe: -655.515285 hartree
dipole: -0.1178 -2.1808 0.0006
dipole: 2.1839
quadrupole: -84.5701 -91.6260 -87.9750
quadrupole: -1.0698 -0.0010 0.0035
quadrupole: 3.4869 -3.5690 0.0820 -1.0698 -0.0010 0.0035
hfenergy: -655.7546066 hartree
pointgroup: C01 [X(C13H18O2)]
dipole: -0.0474834 -0.8579181 -0.000509 debye
polarizability: 164.7066183|14.0865665|119.3417857|0.004876|0.0040901|132.7462755 unknown
InChI: InChI=1S/C13H18O2/c1-12(2)9-14-13(3,15-10-12)11-7-5-4-6-8-11/h4-8H,9-10H2,1-3H3
charge 0 multiplicity 1
33 atoms
O  0.978958 0.919745 1.213576
O  0.979115 0.921131 -1.212197
C  2.479082 -0.680677 -0.000152
C  1.581851 -0.431006 1.239938
C  1.58194 -0.429619 -1.240028
C  0.178461 1.170156 0.000771
C  2.948606 -2.154163 -0.000964
C  3.690904 0.27982 0.000431
C  -1.117691 0.334889 0.000188
C  -0.105247 2.673679 0.001602
C  -1.747092 -0.007029 -1.222107
C  -1.747721 -0.007799 1.221946
C  -2.981064 -0.695143 -1.223133
C  -2.981696 -0.695909 1.221912
C  -3.60228 -1.042751 -0.000879
H  0.783008 -1.201896 1.290534
H  2.168764 -0.454855 2.17394
H  2.168911 -0.45245 -2.174018
H  0.783047 -1.2004 -1.291529
H  3.56687 -2.367181 -0.893264
H  3.566753 -2.368208 0.89117
H  2.094326 -2.857933 -0.001425
H  3.354182 1.329711 0.000951
H  4.31975 0.114962 0.895424
H  4.319882 0.115891 -0.894639
H  -0.682858 2.948329 0.899224
H  0.851768 3.220238 0.001998
H  -0.682706 2.949362 -0.895803
H  -1.260872 0.271334 -2.163985
H  -1.26201 0.270025 2.164244
H  -3.458411 -0.956955 -2.174347
H  -3.459537 -0.958302 2.172717
H  -4.560096 -1.575297 -0.001298
