program: Gaussian 09
title: 000079444
version: EM64L-G09RevD.01
frameworkgroup: C1[X(C13H30N2O4)]
method: RPBEPBE
basis: SDD
operation: Freq
keyword: #p
keyword: freq=noraman
keyword: PBEPBE/SDD
title: #p freq=noraman PBEPBE/SDD
converged: YES YES NO NO
title: Mulliken charges:
elementType: O O O O N N C C C C C C C C C C C C C H H H H H H H H H H H H H H H H H H H H H H H H H H H H H H
charge: -0.455366 -0.449157 -0.450125 -0.451484 -0.099751 -0.109512 -0.379360 -0.388682 -0.355372 -0.349170 -0.364950 -0.353469 -0.371555 -0.371042 -0.363456 -0.328084 -0.325584 -0.325936 -0.325650 0.203302 0.210935 0.221099 0.200399 0.199624 0.179052 0.200837 0.179229 0.183878 0.201405 0.218619 0.226231 0.211435 0.234531 0.209949 0.232009 0.228104 0.209978 0.203802 0.189992 0.182205 0.185033 0.183213 0.186007 0.184564 0.185485 0.344718 0.340406 0.340629 0.341036
chargesum: 0.00000
title: Mulliken charges with hydrogens summed into heavy atoms:
elementType: O O O O N N C C C C C C C C C C C C C
charge: -0.110648 -0.108751 -0.109496 -0.110448 -0.099751 -0.109512 0.034877 0.032816 0.023303 0.030896 0.020334 0.091381 0.074411 0.070916 0.074625 0.065709 0.041653 0.043284 0.044399
polarizability: 1.88307483e+02 5.02626043e+00 1.99031815e+02 -9.39841480e-01 7.65162112e-01 1.38024646e+02
1716.lowfreq: -3.6972 -0.0006 0.0000 0.0007 7.0369 12.6422 13.4011 21.6765 33.4004
frequency: 12.9314 21.5687 33.2123 36.2496 42.8683 45.0592 53.2419 58.4700 63.0800 63.9473 89.2558 101.1879 115.6360 119.3850 154.0461 165.2464 175.0631 186.1105 207.2223 228.5971 252.9332 267.3492 268.1755 276.2182 282.1070 285.6778 298.6496 313.1116 336.2044 370.3240 396.3735 439.9135 462.8635 478.5807 501.2780 528.3783 544.4719 778.6144 779.4705 782.4433 784.4430 808.2323 827.1707 851.5486 874.9732 876.6337 877.5185 964.8110 968.2831 974.5591 978.2940 1001.5510 1015.3976 1016.5869 1018.3690 1031.2960 1035.4690 1049.4313 1058.5923 1068.3730 1077.2806 1085.0241 1095.2035 1112.7848 1133.2588 1150.6710 1151.7521 1168.9035 1188.6008 1205.4260 1206.9772 1211.2079 1212.0183 1231.8289 1232.9066 1241.1889 1257.6545 1275.1010 1276.3828 1276.9951 1282.9848 1285.8772 1286.8020 1288.6933 1292.9692 1304.3977 1310.2831 1314.5239 1338.5972 1349.9111 1376.4340 1379.3831 1384.2217 1390.0916 1410.1866 1416.9354 1417.7827 1418.0214 1468.0987 1468.4743 1469.6661 1470.5572 1473.0757 1476.8108 1478.1141 1478.7281 1481.9714 1485.8118 1490.4462 1491.8221 1492.3179 2833.7073 2843.0798 2846.5659 2898.2512 2912.6852 2919.2817 2923.9246 2924.4632 2926.0173 2944.2773 2969.7894 2970.5954 2971.9006 3002.3630 3004.3280 3005.5833 3007.7188 3012.5597 3012.8155 3023.3798 3025.5330 3045.0304 3055.1896 3074.4374 3075.6078 3077.6847 3563.8519 3563.9212 3564.5304 3576.0214
redmass: 5.4892 5.6600 4.7792 5.1534 4.7325 4.6494 3.4087 2.0188 2.1014 1.9474 2.3458 3.1724 2.7026 2.6527 3.3862 3.1845 2.9575 2.2829 3.5089 2.6843 1.0996 2.4399 1.6709 1.3705 1.1516 1.1367 4.0634 3.2469 3.0831 4.3002 3.3494 4.1620 3.4738 3.1528 3.3247 2.9712 3.3216 1.1023 1.1741 1.0953 1.1469 1.1792 4.0859 3.1132 1.2450 1.3180 1.2683 6.1251 6.7396 6.7370 6.4210 2.4105 2.5423 2.7028 2.5621 2.8100 2.4232 2.3719 2.5844 2.2386 2.5252 2.4263 2.2098 1.7650 1.6310 1.4561 1.4484 1.3316 1.1632 1.3035 1.2766 1.2847 1.2774 1.6486 1.8872 1.6525 1.4317 1.1137 1.1301 1.1647 1.1470 1.1774 1.1612 1.1669 1.2576 1.2899 1.3763 1.3850 1.3888 1.3448 1.3724 1.3478 1.3885 1.3963 1.4542 1.4343 1.4423 1.4457 1.0740 1.0793 1.0751 1.0770 1.0848 1.0844 1.0840 1.0850 1.0839 1.0842 1.0880 1.0883 1.0881 1.0714 1.0709 1.0709 1.0693 1.0697 1.0694 1.0545 1.0546 1.0546 1.0571 1.1064 1.1065 1.1066 1.1030 1.0682 1.0682 1.0628 1.0788 1.0795 1.0840 1.0862 1.0935 1.0944 1.1034 1.1032 1.1032 1.0664 1.0664 1.0664 1.0666
irintensity: 0.0620 0.0475 0.4420 1.3997 1.2363 0.5865 0.3203 20.9398 7.9553 6.6942 14.6820 0.9098 0.8450 0.6542 3.6684 0.6821 0.6617 2.2293 0.4106 8.3473 146.4222 38.0445 22.3691 147.4690 125.5673 128.7378 7.3201 6.4717 11.9024 13.3825 1.7582 0.7079 32.1701 42.9322 6.4095 13.6302 6.2126 5.6585 7.0888 0.3847 9.8854 3.3123 6.1282 3.9998 0.9444 3.6651 2.7349 9.5278 248.5375 18.3354 86.2031 26.0396 3.9698 21.6071 24.2294 6.2586 6.8907 30.1260 0.4942 13.3258 16.7364 8.8430 44.9716 3.8977 22.0903 2.9892 18.2009 0.5919 1.8516 2.6566 55.5071 5.7210 38.2689 37.7391 2.1892 56.7570 4.9627 0.2595 4.5145 0.8572 0.3497 1.6822 13.7769 2.0865 10.2301 8.7749 14.0913 39.2529 1.0060 1.8089 10.5971 3.3210 13.8215 1.7400 0.0693 7.2456 14.8310 0.6738 1.2236 1.6598 2.5411 1.7340 0.6119 8.6540 7.0504 0.3801 10.8317 2.6534 6.2165 5.0140 7.1291 38.0632 160.6541 73.3280 21.3014 42.0198 99.0167 66.6718 95.9055 106.0557 74.5392 57.0230 56.1306 58.0622 45.4068 6.2959 5.9691 15.8380 48.6246 35.9534 36.8170 7.1227 56.5716 64.8606 56.9120 54.4067 54.3441 2.1158 1.9740 2.0934 3.3595
temp: 298.150 k
press: 1.00000 atm
elementType: 8 8 8 8 7 7 6 6 6 6 6 6 6 6 6 6 6 6 6 1 1 1 1 1 1 1 1 1 1 1 1 1 1 1 1 1 1 1 1 1 1 1 1 1 1 1 1 1 1
symmnumber: 1
zpe: 1127703.5 jmol-1
zpe.correction: 0.429520 hartree
zpe.thermalcorrener: 0.455009 hartree
zpe.thermalcorrenthalpy: 0.455953 hartree
zpe.thermalcorrgfe: 0.369172 hartree
zpe.sumelectzpe: -922.067140 hartree
zpe.sumelectthermal: -922.041651 hartree
zpe.sumelectthermalent: -922.040706 hartree
zpe.sumelectthermalfe: -922.127488 hartree
dipole: 1.5485 1.3899 2.8873
dipole: 3.5590
quadrupole: -96.9203 -111.2670 -123.0504
quadrupole: 6.2019 -15.6267 -11.5962
quadrupole: 13.4923 -0.8545 -12.6378 6.2019 -15.6267 -11.5962
hfenergy: -922.4966597 hartree
pointgroup: C01 [X(C13H30N2O4)]
dipole: 0.61858 -0.5442523 -1.1321337 debye
polarizability: 188.3249328|-5.066269|198.9986628|1.2724199|0.7682485|138.0403487 unknown
InChI: InChI=1S/C13H30N2O4/c16-10-1-4-14(5-2-11-17)7-8-15(9-13-19)6-3-12-18/h16-19H,1-13H2
charge 0 multiplicity 1
49 atoms
O  2.984407 4.391588 -0.065943
O  -4.470247 3.685496 0.61283
O  -3.610626 -4.651084 0.631861
O  4.858505 -3.193986 -0.532711
N  -1.601045 -0.229307 -0.254284
N  2.0505 0.783472 0.250437
C  -0.299097 0.419343 -0.554455
C  0.738977 0.16646 0.563353
C  -2.776891 0.54524 -0.72343
C  -1.638272 -1.657561 -0.659625
C  3.222151 0.009608 0.726704
C  2.127486 2.230046 0.566349
C  -3.088716 1.754091 0.184402
C  -2.602244 -2.500688 0.202558
C  3.515159 -1.225761 -0.151598
C  2.886469 2.994856 -0.527022
C  -4.294752 2.554563 -0.315058
C  -2.638194 -3.966606 -0.238619
C  4.698496 -2.043011 0.373944
H  -0.459489 1.509101 -0.651119
H  0.134157 0.075136 -1.523582
H  0.313951 0.530947 1.527466
H  0.881615 -0.924054 0.676687
H  -3.653079 -0.130407 -0.724391
H  -2.64426 0.891969 -1.781728
H  -0.61577 -2.06821 -0.551843
H  -1.905584 -1.768184 -1.743389
H  3.097786 -0.308649 1.794144
H  4.103564 0.679844 0.704121
H  2.619448 2.426405 1.547056
H  1.107291 2.647785 0.637493
H  -2.21973 2.436695 0.238655
H  -3.283742 1.395082 1.210642
H  -3.631355 -2.098375 0.147164
H  -2.289386 -2.440899 1.260331
H  3.724218 -0.896581 -1.185447
H  2.630228 -1.888346 -0.195822
H  2.329514 2.917252 -1.483431
H  3.896324 2.554378 -0.67287
H  -4.110745 2.919891 -1.350253
H  -5.20261 1.911215 -0.329229
H  -2.946843 -4.038977 -1.305521
H  -1.628469 -4.423119 -0.137569
H  5.62052 -1.420151 0.386523
H  4.49617 -2.385662 1.413115
H  3.421877 4.939771 -0.763973
H  -5.254118 4.222525 0.333475
H  -3.647489 -5.611355 0.392192
H  5.621842 -3.747687 -0.229991
