program: Gaussian 09
title: 000079363
version: EM64L-G09RevD.01
frameworkgroup: C1[X(C12H7N3O3)]
method: RPBEPBE
basis: SDD
operation: Freq
keyword: #p
keyword: freq=noraman
keyword: PBEPBE/SDD
title: #p freq=noraman PBEPBE/SDD
converged: YES YES NO NO
title: Mulliken charges:
elementType: O O O N N N C C C C C C C C C C C C H H H H H H H
charge: -0.220025 -0.201012 -0.204717 -0.288881 0.071230 0.018313 0.220766 0.201115 0.222656 0.243026 -0.538538 -0.286460 -0.374149 -0.346368 0.403745 -0.374832 -0.235914 -0.207592 0.297425 0.304759 0.247864 0.278135 0.294251 0.236580 0.238621
chargesum: 0.00000
title: Mulliken charges with hydrogens summed into heavy atoms:
elementType: O O O N N N C C C C C C C C C C C C
charge: -0.220025 -0.201012 -0.204717 -0.288881 0.071230 0.018313 0.220766 0.201115 0.222656 0.243026 -0.241112 0.018299 -0.126284 -0.068233 0.403745 -0.080581 0.000666 0.031029
polarizability: 2.73845625e+02 -7.40366933e+00 2.11731229e+02 1.97981382e-02 8.03850555e-03 5.94383111e+01
1716.lowfreq: -8.0797 0.0007 0.0008 0.0011 2.8372 6.6406 54.1579 69.5202 95.1919
frequency: 54.1555 69.5177 95.1900 126.6821 129.3251 178.7318 199.7703 243.3717 249.6107 308.3711 310.6544 388.0700 396.4974 425.2372 459.6885 460.1824 493.3137 551.2873 571.2039 577.5121 599.6786 618.3783 685.6836 698.0388 725.0979 741.7133 743.8696 763.6696 782.9672 840.7349 862.6239 881.5966 938.7749 952.6425 959.0907 976.3582 993.7144 997.4457 1006.9902 1027.1615 1075.1953 1113.3621 1116.9270 1171.8218 1203.2186 1211.1634 1221.3642 1234.6908 1279.9841 1302.6714 1359.1723 1371.0113 1401.4912 1410.8158 1433.9138 1446.7079 1465.9242 1481.3512 1590.2172 1600.0552 1610.1818 1627.1392 3140.9116 3152.3693 3169.2236 3181.1123 3185.2596 3185.8513 3217.8911
redmass: 14.1128 8.6261 5.1595 5.0969 8.4280 10.4187 5.3563 10.1624 7.6731 4.8360 10.3333 10.7243 7.0636 3.1771 3.2379 7.0459 7.6289 5.3900 4.6147 4.0448 9.2193 7.5264 6.6232 5.6309 8.7352 7.6208 3.4208 2.0375 2.2444 7.6415 1.4268 1.3992 1.5063 8.2856 1.3966 7.9913 1.3299 1.3347 3.1929 1.9753 2.7689 1.7017 1.5535 1.1265 3.3264 8.7417 2.6548 2.0070 1.9450 1.7873 6.6089 11.6031 6.7829 3.1566 2.9201 5.5522 3.2628 3.8536 8.4323 7.4007 7.9079 7.9291 1.0865 1.0916 1.0971 1.0929 1.0912 1.0976 1.0958
irintensity: 0.2880 2.7094 1.5105 2.0447 2.2902 3.1060 0.8915 0.1390 0.9495 0.0820 0.6208 2.8281 0.0780 8.9114 0.0373 3.5693 8.8642 2.9410 0.8817 4.4337 7.0720 5.9898 6.4243 30.5509 62.4923 10.1244 6.3471 42.8808 36.1997 2.4239 47.2147 0.0838 25.5719 32.2910 2.9106 197.7436 0.0758 0.0115 15.3927 20.1052 40.3946 14.5008 110.6906 2.8547 146.2734 282.2757 65.1022 11.2432 11.4004 38.8203 54.0584 207.3704 5.3039 8.5832 63.5292 15.9631 6.0163 2.8696 3.8632 4.9068 7.6889 1.4259 0.3922 9.0284 18.2374 2.5668 6.4795 4.0775 1.1404
temp: 298.150 k
press: 1.00000 atm
elementType: 8 8 8 7 7 7 6 6 6 6 6 6 6 6 6 6 6 6 1 1 1 1 1 1 1
symmnumber: 1
zpe: 448872.4 jmol-1
zpe.correction: 0.170966 hartree
zpe.thermalcorrener: 0.184446 hartree
zpe.thermalcorrenthalpy: 0.185390 hartree
zpe.thermalcorrgfe: 0.130294 hartree
zpe.sumelectzpe: -850.044543 hartree
zpe.sumelectthermal: -850.031064 hartree
zpe.sumelectthermalent: -850.030120 hartree
zpe.sumelectthermalfe: -850.085216 hartree
dipole: 4.7466 -1.7639 0.0002
dipole: 5.0637
quadrupole: -115.8666 -103.8766 -103.9296
quadrupole: -16.5239 -0.0020 -0.0034
quadrupole: -7.9757 4.0143 3.9613 -16.5239 -0.0020 -0.0034
hfenergy: -850.2155098 hartree
pointgroup: C01 [X(C12H7N3O3)]
dipole: -1.8915755 -0.6252269 -0.0000726 debye
dipolederiv: -0.0113799 -0.8522509 0.0001595 0.3498954 -1.3429882 0.0001559 -0.0000316 0.000329 -0.156344 -1.0245407 -0.1037438 -0.0000515 -0.1331596 -0.4831092 0.0000182 -0.0000922 -0.0000076 -0.2232155 -0.6398601 0.1421023 -0.0000468 0.2901351 -0.8024256 0.000042 -0.0000634 0.0000693 -0.2262034 -0.6975324 0.7127715 -0.0000976 0.268222 -1.1696513 0.0001915 0.0000425 0.0000437 0.028133 0.0077163 0.0907947 -0.0001027 -0.749071 2.0736367 -0.0003561 -0.0000221 -0.0004087 -0.0624624 2.0120426 -0.2695654 0.0001723 -0.4393246 1.1553555 -0.0001002 0.0001867 -0.0000723 0.1848771 0.2268507 0.0464536 0.0000237 0.4762649 -0.1481382 0.0000556 -0.0000235 0.0000235 0.0166358 0.0127622 0.2646342 -0.0000156 -0.0689338 -0.0249101 -0.0000052 -0.0000129 -0.0000017 -0.0105579 0.5203404 -0.2846545 0.0000739 -0.4101942 -0.0288773 -0.0000362 0.0000449 0.0000295 0.0812462 0.0938099 0.236257 -0.0000229 0.3921089 0.4679848 0.0000106 0.0000289 -0.0000094 0.0564844 0.1304904 -0.093463 0.0000169 0.0554017 -0.0082357 0. 0.0000173 -0.00002 -0.110838 -0.2833876 0.0770825 -0.0000196 0.0462043 0.0751417 0.0000064 -0.0000184 0.0000127 -0.1252846 0.0153619 -0.1910783 0.000022 0.0220158 0.0292955 0.0000028 0.0000085 -0.0000158 -0.1314488 -0.0286869 -0.137829 0.0000198 -0.1328121 -0.0478919 -0.0000091 0.0000132 -0.0000125 -0.1430083 -0.6939148 0.2386563 -0.0000853 0.3301645 -0.1761783 0.0000554 -0.0000668 0.0000236 0.0750808 0.0368428 -0.0567501 0.0000177 -0.3194921 0.0935896 -0.0000435 0.000045 -0.0000351 -0.132654 -0.1374137 0.1241464 -0.0000048 0.1089342 0.0699465 0.0000096 -0.0000006 0.0000032 -0.1494811 0.0939908 0.0122864 0.0000226 -0.0505447 0.0323824 -0.0000135 0.0000244 -0.0000084 -0.1496757 0.1439087 0.0007456 -0.0000018 -0.0231895 0.0432955 -0.0000007 0.0000107 0.0000025 0.166295 0.0954148 0.065951 -0.0000165 -0.0034684 0.0466229 -0.0000004 -0.0000236 0.000027 0.1826229 0.0273596 0.1040761 -0.0000136 0.0561902 0.0056945 0.0000089 -0.0000081 0.000017 0.1550051 0.0785765 0.0298188 -0.0000098 0.0723703 0.022577 0.0000119 -0.0000132 0.0000138 0.1770692 0.0787305 -0.0488124 -0.0000073 -0.0129689 0.1087415 0.0000002 -0.0000122 -0.000003 0.1738564 0.0464927 -0.0697101 -0.0000098 -0.0895966 -0.0764703 -0.0000029 -0.0000107 -0.0000011 0.1630891 -0.1039746 -0.0379189 -0.0000227 -0.0351518 0.0846121 -0.0000013 -0.0000229 0.0000006 0.1607788 unknown
polarizability: 274.3037071|5.1138031|211.273147|0.0194909|-0.0087572|59.4383111 unknown
charge 0 multiplicity 1
25 atoms
O  -1.231931 3.589613 -0.000619
O  4.896701 -0.031578 0.000426
O  3.938985 -2.101891 0.000462
N  -1.361133 1.335816 -0.000146
N  -2.020342 2.587363 -0.00026
N  3.868395 -0.811739 0.000322
C  0.125128 -0.430282 0.000013
C  -1.237327 -0.976559 -0.000088
C  0.025762 1.005403 -0.000022
C  -2.136489 0.130686 -0.000194
C  1.390694 -1.038753 0.000136
C  1.159953 1.844264 0.000062
C  -1.755752 -2.288939 -0.000102
C  -3.532246 -0.01557 -0.000316
C  2.520222 -0.189648 0.000204
C  2.426495 1.223526 0.000165
C  -3.159026 -2.4590 -0.000232
C  -4.033034 -1.338575 -0.000339
H  1.529483 -2.122765 0.000169
H  1.061662 2.929306 0.00004
H  -1.091115 -3.158987 -0.000026
H  -4.196663 0.85158 -0.000394
H  3.346074 1.814028 0.000226
H  -3.581251 -3.469124 -0.000252
H  -5.115943 -1.500874 -0.000436
