program: Gaussian 09
title: 000079352
version: EM64L-G09RevD.01
frameworkgroup: C1[X(C12H10O2)]
method: RPBEPBE
basis: SDD
operation: Freq
keyword: #pfreq=noraman
keyword: PBEPBE/SDD
title: #p freq=noraman PBEPBE/SDD
converged: YES YES NO NO
title: Mulliken charges:
elementType: O O C C C C C C C C C C C C H H H H H H H H H H
charge: -0.253586 -0.239028 0.279909 0.408061 0.081410 0.195031 -0.420687 -0.390100 -0.370485 -0.422640 -0.253051 -0.248416 -0.187972 -0.524828 0.244146 0.225140 0.262068 0.242610 0.230213 0.233618 0.170297 0.230921 0.215762 0.291607
chargesum: 0.00000
title: Mulliken charges with hydrogens summed into heavy atoms:
elementType: O O C C C C C C C C C C C C
charge: -0.253586 -0.239028 0.279909 0.408061 0.081410 0.195031 -0.176541 -0.164959 -0.108418 -0.180030 -0.022838 -0.014798 -0.017676 0.213462
polarizability: 2.17334723e+02 -4.47223706e+00 1.50328250e+02 2.73229688e+00 -3.78070908e+00 6.16729152e+01
1716.lowfreq: -5.7514 -2.3403 -0.0006 0.0007 0.0010 7.9872 61.5012 83.4164 116.9650
frequency: 61.4945 83.4137 116.9594 163.3015 176.8497 201.6326 222.6838 274.6572 304.0093 348.4318 402.3785 408.6194 426.4737 481.6563 515.9966 526.3964 545.9176 643.9214 658.6851 683.1733 751.8669 759.9913 789.3708 837.0247 848.6611 880.5802 894.3023 954.9606 959.2506 981.2283 985.5722 993.3706 1041.2052 1077.6391 1112.0793 1149.0035 1154.3174 1179.5234 1195.9248 1230.2953 1234.8209 1278.0105 1318.1941 1390.9531 1400.8477 1415.2587 1421.8997 1440.6224 1448.4452 1461.3479 1474.6220 1515.6668 1549.0679 1586.5424 1605.7897 1625.5484 2946.1640 2984.8283 3096.3745 3125.2280 3129.7695 3133.5221 3136.2154 3157.7428 3170.4872 3173.9260
redmass: 3.6366 4.0223 2.5631 3.6865 1.4096 5.0082 3.2169 4.4927 3.7787 4.2632 3.7452 7.0753 4.4773 4.7333 3.3348 5.7902 3.4686 6.0985 6.0800 3.2773 3.5704 1.5160 2.9918 1.5147 4.1897 1.6940 6.9634 1.4917 1.7797 1.5357 4.2037 1.3659 2.2414 2.5054 1.2364 1.4055 1.2615 1.1502 1.8849 3.0321 1.8319 1.8563 3.3067 2.3920 3.7469 1.6384 2.2842 1.3509 1.4171 1.7760 1.0726 3.3931 6.2275 6.0660 6.1295 6.4011 1.0825 1.0313 1.1006 1.0869 1.1055 1.0894 1.0891 1.0942 1.0987 1.0960
irintensity: 0.9941 3.2864 4.5529 3.3438 1.5550 2.6004 11.9317 3.2862 2.7200 11.7162 3.3560 7.5272 4.8193 10.6802 14.2842 3.5268 1.2509 9.7987 14.8377 3.5056 12.1385 56.5661 3.6056 60.7355 4.8752 10.9297 2.6151 1.7039 1.8179 1.2239 38.2140 0.1310 5.0598 33.1697 4.5567 1.5834 7.8765 14.2709 61.4741 121.9143 12.1588 28.1701 25.1531 26.7236 2.1394 74.6107 2.1161 26.9563 21.0766 32.0485 48.6915 26.9642 122.8379 125.7890 79.9178 48.5379 73.3526 55.2993 25.5500 2.0954 13.0376 4.4024 12.2637 28.1817 26.2302 5.2647
temp: 298.150 k
press: 1.00000 atm
elementType: 8 8 6 6 6 6 6 6 6 6 6 6 6 6 1 1 1 1 1 1 1 1 1 1
symmnumber: 1
zpe: 485951.3 jmol-1
zpe.correction: 0.185089 hartree
zpe.thermalcorrener: 0.196861 hartree
zpe.thermalcorrenthalpy: 0.197805 hartree
zpe.thermalcorrgfe: 0.147287 hartree
zpe.sumelectzpe: -612.721565 hartree
zpe.sumelectthermal: -612.709793 hartree
zpe.sumelectthermalent: -612.708849 hartree
zpe.sumelectthermalfe: -612.759367 hartree
dipole: 2.4520 1.2788 2.0510
dipole: 3.4430
quadrupole: -75.0179 -75.4398 -85.4053
quadrupole: -3.8579 -6.7834 -3.6922
quadrupole: 3.6031 3.1812 -6.7843 -3.8579 -6.7834 -3.6922
hfenergy: -612.9066541 hartree
pointgroup: C01 [X(C12H10O2)]
dipole: 0.9855822 0.6028294 0.7071761 debye
dipolederiv: -1.6653559 0.2328434 0.3198902 -0.1359884 -0.2793238 0.0260528 0.1385677 0.0691398 -0.3598658 -0.9941286 -0.5953641 -0.0959294 -0.2767313 -0.6248718 -0.0387308 -0.146954 -0.1632809 -0.3836287 0.4346411 0.1839668 0.0239821 -0.1620659 -0.0447119 -0.0168322 0.0728979 0.0328217 0.0268948 -0.1421599 0.0179303 0.0115625 0.0334737 -0.2751384 0.0432762 -0.0205168 0.0756309 0.0311176 -0.4636236 -0.1551018 0.0109083 -0.1875328 -0.8844827 -0.0445998 0.0021117 0.1119716 -0.0908726 1.4236709 -0.3031133 -0.2793254 0.1440241 0.3811066 0.0675474 -0.1490305 -0.0535888 0.112106 0.3707752 -0.0520556 -0.0260257 -0.1752634 0.1901515 -0.0703243 -0.0062336 -0.0828198 -0.1136141 -0.2195662 -0.0216554 -0.0154546 0.111545 0.1106332 -0.0568634 -0.0428903 -0.0533427 -0.1446479 -0.5393032 -0.0777956 0.0676561 -0.3216581 0.0183826 -0.0113865 0.1700038 -0.0980451 -0.1819881 0.1473765 -0.0516709 0.0041894 0.0811485 0.1278377 -0.0667916 -0.0232271 -0.0675332 -0.1498521 -0.0139023 0.0276287 0.0114068 -0.0480184 0.1737336 -0.0752164 0.0193613 -0.0886537 -0.1245614 0.0548599 0.0660592 -0.0072817 0.1198494 -0.1978319 -0.0073681 -0.0234134 0.0118995 -0.1691754 0.9483001 0.5498464 0.2078532 0.4962955 1.2283017 0.0391594 0.2042483 0.0544531 0.1522448 0.5978849 -0.0280952 -0.1539372 0.3110266 0.1696469 -0.1160599 -0.3311425 -0.0094125 0.381899 0.0391582 -0.104777 0.0309443 -0.0409835 -0.0372245 0.0476236 0.0068161 0.058114 0.1364779 0.0681114 -0.0973991 0.0286015 -0.0449946 -0.044223 0.052338 0.0142314 0.0476724 0.1356705 0.0508443 0.0842539 -0.0127926 0.0613147 0.0044584 0.0272972 0.0398904 0.0286824 0.157795 0.0509208 -0.0313257 0.0053345 -0.1038716 -0.0683148 0.0535646 0.0223619 0.0502799 0.1431099 0.0085389 0.0919814 -0.0259664 0.1088294 -0.0426157 0.0540767 -0.028608 0.0541722 0.142713 -0.1383906 -0.0142244 -0.0008802 -0.0145811 0.095456 0.0176884 -0.0043838 0.0168371 0.1614962 -0.038925 0.1892727 -0.0464348 0.0985169 -0.0967904 0.0374041 -0.0668121 0.04202 0.0880803 -0.0868318 0.0829973 0.0783205 0.1476769 0.0179346 -0.0349887 0.1340494 -0.0186259 0.0718466 -0.0288319 0.0219796 -0.1269588 -0.0470161 0.0606363 0.070393 0.0296559 0.0238468 -0.0904912 0.1359368 -0.0161817 -0.0096628 -0.1549953 0.01725 0.0027403 -0.0109836 -0.0422388 0.0672459 unknown
polarizability: 217.4365721|-4.1167608|148.1047713|-1.9737728|-14.0519753|63.7945443 unknown
InChI: InChI=1S/C12H10O2/c1-14-12-7-6-9-4-2-3-5-10(9)11(12)8-13/h2-8H,1H3
charge 0 multiplicity 1
24 atoms
O  -2.863557 1.023359 0.08769
O  -2.579556 -1.964488 -0.326531
C  0.706545 -0.292688 0.12517
C  1.357824 0.967891 -0.165471
C  -0.760103 -0.375536 0.099858
C  -1.496459 0.839084 -0.049487
C  0.552821 2.12313 -0.448543
C  1.555293 -1.412069 0.422016
C  -0.829761 2.066143 -0.376205
C  2.785556 1.063094 -0.168623
C  2.950654 -1.291754 0.421475
C  3.579858 -0.049236 0.117261
C  -1.38671 -1.707903 0.024428
C  -3.681222 0.214297 1.0126
H  1.050679 3.069491 -0.689661
H  1.126962 -2.384731 0.67789
H  -1.455864 2.949127 -0.532534
H  3.246216 2.031784 -0.395946
H  3.566044 -2.165447 0.66315
H  4.671932 0.028498 0.116114
H  -0.70708 -2.563226 0.230136
H  -4.522093 0.872201 1.280828
H  -3.09476 -0.050613 1.912172
H  -4.019518 -0.70391 0.509014
