program: Gaussian 09
title: 000000332
version: EM64L-G09RevD.01
frameworkgroup: C1[X(C9H10O2)]
method: RPBEPBE
basis: SDD
operation: Freq
keyword: #pfreq=noraman
keyword: PBEPBE/SDD
title: #p freq=noraman PBEPBE/SDD
converged: NO YES NO NO
title: Mulliken charges:
elementType: O O C C C C C C C C C H H H H H H H H H H
charge: -0.242980 -0.401439 0.533181 0.219729 -0.527809 0.152245 -0.409051 -0.354769 -0.211038 -0.537155 -0.583248 0.242029 0.225551 0.216912 0.211807 0.220344 0.220274 0.247991 0.353830 0.213476 0.210120
chargesum: 0.00000
title: Mulliken charges with hydrogens summed into heavy atoms:
elementType: O O C C C C C C C C C
charge: -0.242980 -0.047609 0.533181 0.219729 -0.285780 0.152245 -0.183500 -0.137857 0.000769 0.151454 -0.159652
polarizability: 1.72491382e+02 -4.56707657e+00 1.18226282e+02 1.29713333e-02 2.66599022e-02 4.75578382e+01
1716.lowfreq: -9.9008 -8.8039 -0.0004 0.0004 0.0005 5.8056 61.4711 94.2354 137.6165
frequency: 61.4568 94.2296 137.6143 167.0715 198.2527 235.7334 266.4523 322.0431 334.6169 362.1017 395.4822 453.1796 470.8284 529.5854 545.6679 576.7069 697.8466 698.8114 743.4400 764.3626 801.2924 872.0406 898.0978 912.4087 922.4099 994.4870 1007.2174 1031.9198 1084.9349 1109.8552 1151.8211 1169.3644 1179.2923 1242.8389 1273.6789 1291.3263 1318.4294 1386.7900 1413.4020 1431.9271 1446.9237 1465.9673 1470.9385 1517.2772 1596.3657 1612.4566 1644.4838 2958.6960 3047.0686 3081.8949 3102.1079 3110.7402 3128.4881 3145.0518 3157.1591 3203.5883 3572.3354
redmass: 2.7391 3.1518 3.5758 3.3606 1.7010 3.8027 1.4729 4.2526 2.8077 1.2333 5.4900 3.1432 4.1974 5.4940 2.4358 3.3565 2.1667 4.6151 2.3455 5.4858 1.5347 1.7173 5.2519 1.3957 1.3544 5.0579 1.1609 1.5072 2.2467 1.2601 1.3531 1.1808 1.7347 2.3972 3.0618 1.6124 1.3231 2.7951 4.7832 1.1943 1.4041 1.0507 1.0642 3.0445 6.1304 6.4913 4.4830 1.0329 1.1040 1.0825 1.0690 1.0890 1.0991 1.0902 1.0943 1.1139 1.0660
irintensity: 0.0063 8.7194 4.0180 1.0957 0.3565 9.5623 0.6592 3.4999 4.6935 135.0854 3.9431 3.5306 0.9988 1.3006 13.3225 12.9873 4.0335 1.4790 0.5840 28.6512 33.5676 37.5357 1.6023 36.0646 50.3754 50.9129 23.5574 20.7604 197.8817 0.2101 16.9193 48.6849 47.0093 71.0892 195.1233 6.5263 2.6636 43.1340 10.8518 2.2043 5.2320 13.4992 47.9262 110.2100 63.1682 35.2791 21.6396 59.6967 50.5154 24.6095 4.1248 20.4844 24.3585 11.1802 7.2407 23.8280 47.3443
temp: 298.150 k
press: 1.00000 atm
elementType: 8 8 6 6 6 6 6 6 6 6 6 1 1 1 1 1 1 1 1 1 1
symmnumber: 1
zpe: 435503.9 jmol-1
zpe.correction: 0.165875 hartree
zpe.thermalcorrener: 0.176609 hartree
zpe.thermalcorrenthalpy: 0.177553 hartree
zpe.thermalcorrgfe: 0.129686 hartree
zpe.sumelectzpe: -498.549983 hartree
zpe.sumelectthermal: -498.539250 hartree
zpe.sumelectthermalent: -498.538305 hartree
zpe.sumelectthermalfe: -498.586172 hartree
dipole: 0.6633 -0.1805 -0.0004
dipole: 0.6875
quadrupole: -67.8936 -45.1425 -70.2242
quadrupole: 2.3247 0.0126 -0.0151
quadrupole: -6.8068 15.9443 -9.1374 2.3247 0.0126 -0.0151
hfenergy: -498.7158581 hartree
pointgroup: C01 [X(C9H10O2)]
dipole: 0.2640755 -0.0584272 -0.0020914 debye
dipolederiv: -0.9837437 -0.7031265 0.0265129 -0.6973837 -0.9736757 0.0262583 0.0258638 0.026447 -0.2806139 -1.2870126 0.6693584 -0.0066306 0.6869096 -0.3782054 -0.0097659 -0.0055352 -0.0099672 -0.3903503 -0.0675469 0.1224754 -0.0016536 0.0365556 -0.0785642 0.0028313 -0.0003563 0.0016386 0.0576388 0.8739753 0.7888361 -0.0299335 0.9693927 0.373824 -0.0188839 -0.0344538 -0.0168374 0.0950926 -0.120309 -0.2312445 0.0044635 0.0757348 0.0117968 -0.0068526 -0.0028691 -0.0027144 -0.2415797 1.0727552 -0.659163 0.0046727 -0.8192581 0.2226548 0.0050845 0.0084608 0.003303 0.0191879 -0.0511541 -0.12244 0.0020186 0.0655327 0.0117249 -0.0048944 -0.0018001 -0.0024665 -0.1770985 -0.2536952 0.2448675 -0.0051882 -0.1295938 0.0916151 -0.0046652 0.0038137 -0.0094611 -0.1770552 0.510494 -0.1318625 -0.005472 -0.2761501 0.2337947 -0.0057237 -0.0021664 -0.007525 -0.1439072 0.2248668 0.0112316 0.0010621 0.3613783 0.7770429 -0.0157159 -0.0080733 -0.0116308 0.3308947 -0.4575895 0.0524643 -0.000852 -0.0637534 0.0933744 -0.011792 0.002889 -0.0133499 -0.42886 0.1085792 0.0288213 -0.0000525 -0.0015597 -0.0925933 0.0060158 0.000932 0.0056591 0.1636898 -0.0405162 -0.1013647 0.0044307 -0.0733071 0.0321417 0.0036404 0.0036582 0.0038741 0.1556827 0.0491013 0.0644923 -0.0001764 0.0576528 -0.1324125 0.0063502 -0.0002069 0.0063643 0.1676864 0.0439457 -0.0605961 0.0029035 0.0484132 -0.1415071 0.0065152 0.0003438 0.0079334 0.1497446 0.0628757 0.1144125 -0.1233575 -0.0522924 -0.052946 0.0408588 -0.0685364 0.0842899 -0.0923552 0.067977 0.1180505 0.112989 -0.0500329 -0.0601672 -0.0419111 0.0669282 -0.0894067 -0.0909161 -0.1154125 -0.1160818 0.0063795 -0.0718544 0.0419571 0.0030457 0.0052637 0.0036493 0.1234279 0.3390253 -0.1804346 0.0055106 -0.1424079 0.1211367 0.0090321 0.003679 0.009827 0.3807975 -0.07474 0.0827318 0.0014192 0.101818 0.0216242 0.0027693 0.0005465 0.003102 0.1914494 0.0981241 0.008572 0.000954 -0.0257943 -0.1226158 0.0078031 0.0016188 0.0072712 0.1874436 unknown
polarizability: 172.7850282|-1.9725423|117.8725017|-1.5321441|-1.6816638|47.6179721 unknown
InChI: InChI=1S/C9H10O2/c1-3-7-4-5-8(10)9(6-7)11-2/h3-6,10H,1H2,2H3
charge 0 multiplicity 1
21 atoms
O  -2.301486 -1.006882 0.036715
O  -2.471705 1.664709 -0.028186
C  1.38621 -0.134447 -0.030407
C  -1.085451 -0.314782 0.004246
C  0.192013 -0.913154 0.00262
C  -1.184174 1.108813 -0.029521
C  1.265755 1.27768 -0.061966
C  -0.005521 1.885882 -0.061233
C  2.684024 -0.839866 -0.031128
C  -2.235681 -2.471233 0.074381
C  3.930047 -0.290031 -0.060915
H  0.282314 -2.00447 0.026861
H  2.160342 1.907628 -0.086184
H  -0.087315 2.980877 -0.085682
H  2.613904 -1.938036 -0.003315
H  -1.710972 -2.827237 0.982406
H  -1.736692 -2.875652 -0.827838
H  -3.284827 -2.799338 0.097835
H  -2.414954 2.652691 -0.056778
H  4.824581 -0.921017 -0.057129
H  4.099186 0.792764 -0.088981
