program: Gaussian 09
title: 000079377
version: EM64L-G09RevD.01
frameworkgroup: C1[X(C15H32N2S)]
method: RPBEPBE
basis: SDD
operation: Freq
keyword: #p
keyword: freq=noraman
keyword: PBEPBE/SDD
title: #p freq=noraman PBEPBE/SDD
converged: YES YES NO NO
title: Mulliken charges:
elementType: S N N C C C C C C C C C C C C C C C H H H H H H H H H H H H H H H H H H H H H H H H H H H H H H H H
charge: 0.089666 -0.307383 -0.013178 -0.384623 -0.385396 -0.385271 -0.381321 -0.379938 -0.373219 -0.370395 -0.352954 -0.334535 -0.356869 -0.665864 -0.696503 -0.170566 -0.601157 -0.666911 0.194356 0.193558 0.193526 0.192841 0.194055 0.193394 0.192375 0.191610 0.193846 0.195613 0.189099 0.189649 0.192540 0.193014 0.187863 0.187361 0.210373 0.212290 0.194611 0.194816 0.261969 0.264466 0.209600 0.214973 0.209699 0.323345 0.250098 0.205357 0.239671 0.232876 0.218134 0.219436
chargesum: 0.00000
title: Mulliken charges with hydrogens summed into heavy atoms:
elementType: S N N C C C C C C C C C C C C C C C
charge: 0.089666 0.015963 -0.013178 0.003291 0.000971 0.002178 0.002664 0.009521 0.005530 0.015160 0.022270 0.088128 0.032558 -0.139429 -0.062231 -0.170566 0.093968 0.003535
polarizability: 2.75600118e+02 1.08625017e-01 1.78128988e+02 1.10509072e+01 2.50739409e+00 1.59372675e+02
1716.lowfreq: -4.6153 -0.0018 -0.0005 0.0012 5.4063 8.5032 11.7439 17.8199 24.3327
frequency: 11.5931 17.6670 24.2564 34.7772 40.8914 52.2662 55.8779 73.7643 85.8586 89.4874 103.0432 108.6638 122.6455 125.9588 135.6790 139.5398 152.2550 155.7569 161.2257 176.2325 199.4178 220.6297 229.0113 237.8323 239.5214 277.1909 324.2616 364.6251 404.3039 417.0845 434.4612 473.9341 490.8347 491.4838 597.3050 685.1813 700.3020 720.9844 723.0363 728.2331 738.6016 755.9354 785.1600 827.9190 878.2194 888.3483 930.2538 930.9838 979.5236 981.1989 987.2080 1016.1018 1021.9307 1024.0611 1028.5339 1051.4752 1063.5976 1069.2220 1073.3932 1079.0234 1080.3843 1085.4235 1098.1627 1109.9757 1122.0242 1123.2759 1166.8794 1180.3737 1198.8541 1200.2381 1223.9656 1224.7092 1246.1291 1248.7132 1252.6342 1270.2122 1272.9753 1278.1490 1283.5378 1287.4110 1291.5883 1296.9075 1297.4080 1299.0116 1322.5105 1341.6335 1351.8790 1354.9733 1358.5625 1358.9815 1389.1479 1414.7961 1426.5168 1445.4682 1452.6370 1456.3762 1459.7413 1459.9137 1463.3008 1463.3896 1464.5837 1465.9987 1468.7892 1473.4096 1476.8284 1477.2617 1478.8313 1483.2293 1486.9007 1488.8120 1496.4196 1697.8296 2925.2503 2948.9480 2949.0470 2950.8358 2951.6729 2953.9616 2956.3497 2960.6620 2964.9188 2968.0183 2971.4041 2975.8217 2979.3551 2981.9079 2985.1054 2989.7979 2995.7966 3003.5085 3013.2318 3015.1280 3020.5724 3023.3804 3032.5060 3040.2433 3040.7645 3046.0852 3055.1917 3067.8642 3070.3787 3095.4092 3099.7975 3597.6936
redmass: 3.8308 4.1100 3.9973 1.7900 3.5486 3.1118 1.8494 2.3423 2.6217 2.3239 1.1434 1.6219 4.6224 2.1616 1.7727 2.6699 1.8125 1.9475 1.8905 4.1771 2.6681 3.6365 1.1316 4.0971 3.3708 4.0562 3.3927 4.9403 3.7086 3.2472 1.1226 4.0509 3.5148 3.0855 8.1677 3.9270 6.0850 1.0588 1.0675 1.0797 1.0961 1.1299 1.1769 1.2181 1.2369 1.8976 6.0514 1.2244 5.0009 1.2007 4.8036 3.8591 2.6899 1.1137 3.6164 3.2388 1.0766 2.6479 2.7906 2.1890 2.1602 2.5701 1.3256 1.3696 1.3525 2.5941 2.0045 1.9152 1.5368 1.2950 1.4393 1.2844 1.4814 1.3582 2.0183 1.2464 1.2869 1.0182 1.0698 1.1413 1.0706 1.1391 1.1057 1.2832 1.3578 1.4308 1.5349 1.6875 1.6179 1.6306 1.2182 1.1859 1.2276 1.2004 1.0827 1.2393 1.0750 1.0756 1.0700 1.0712 1.0590 1.0673 1.0819 1.0824 1.0425 1.0598 1.0784 1.0903 1.0943 1.0951 1.0654 8.3889 1.0378 1.0587 1.0587 1.0592 1.0592 1.0592 1.0593 1.0591 1.0587 1.0586 1.0365 1.0354 1.0591 1.0962 1.0972 1.0987 1.1004 1.1024 1.1039 1.0957 1.0566 1.1043 1.1047 1.1046 1.0971 1.1045 1.0987 1.1006 1.0993 1.1089 1.1013 1.0786
irintensity: 0.1180 0.0955 0.0763 0.1326 0.2943 0.0231 0.1314 0.4394 0.1135 0.0165 0.1865 0.1069 0.3567 0.0244 0.1614 5.7754 0.6046 1.6146 1.6006 6.5356 2.7826 0.7524 0.0042 5.5994 0.3567 1.4182 1.7343 20.3768 15.3053 1.7837 98.7354 1.3275 1.2726 0.5067 2.7904 33.0854 5.1107 17.3894 0.1986 8.3421 0.7034 3.9255 0.0044 1.4071 0.0731 4.6634 126.8622 0.8197 0.2023 0.0851 1.3638 1.2162 7.9555 0.7751 0.6888 0.2744 0.6025 0.4107 1.2299 0.3661 0.0516 2.1917 0.4200 0.2138 5.6193 12.3910 44.2281 0.1376 2.9239 15.1335 0.7310 5.1759 18.1790 1.1724 20.3946 0.3433 4.6780 0.1127 0.2261 0.0205 0.2512 0.4316 0.4528 4.5530 3.8022 5.1235 0.4808 0.2929 0.0159 0.9751 11.2357 22.6761 41.6963 78.1050 3.5019 48.1616 0.0127 0.1825 0.1081 2.8935 20.1080 0.6342 1.0487 1.6111 12.2554 9.5798 3.6137 0.6613 3.4509 39.7129 43.6105 318.3072 80.8819 0.0042 0.0449 0.0183 0.5149 0.0692 1.9130 3.8235 87.4437 209.8694 38.0975 68.7077 44.9634 0.0265 0.0361 0.0783 0.1602 0.3111 0.0177 40.7154 21.5491 3.1745 1.5121 78.1312 43.0690 230.1730 38.1908 98.0335 56.0463 31.9740 25.4491 42.7759
temp: 298.150 k
press: 1.00000 atm
elementType: 16 7 7 6 6 6 6 6 6 6 6 6 6 6 6 6 6 6 1 1 1 1 1 1 1 1 1 1 1 1 1 1 1 1 1 1 1 1 1 1 1 1 1 1 1 1 1 1 1 1
symmnumber: 1
zpe: 1173453.1 jmol-1
zpe.correction: 0.446945 hartree
zpe.thermalcorrener: 0.472427 hartree
zpe.thermalcorrenthalpy: 0.473371 hartree
zpe.thermalcorrgfe: 0.386226 hartree
zpe.sumelectzpe: -1096.842596 hartree
zpe.sumelectthermal: -1096.817114 hartree
zpe.sumelectthermalent: -1096.816170 hartree
zpe.sumelectthermalfe: -1096.903315 hartree
dipole: -1.1626 -0.9466 1.2008
dipole: 1.9208
quadrupole: -129.7038 -117.7842 -126.1338
quadrupole: -10.1541 6.7710 -4.4447
quadrupole: -5.1632 6.7564 -1.5932 -10.1541 6.7710 -4.4447
hfenergy: -1097.2895411 hartree
pointgroup: C01 [X(C15H32N2S1)]
dipole: 0.4642865 -0.5775757 -0.1481277 debye
polarizability: 275.5167191|8.0763708|168.8530219|8.1894617|-9.6425324|168.7320401 unknown
InChI: InChI=1S/C15H32N2S/c1-4-5-6-7-8-9-10-11-12-13-14-18-15(16-2)17-3/h16H,4-14H2,1-3H3
charge 0 multiplicity 1
50 atoms
S  -5.155269 0.064679 1.306918
N  -7.322107 -1.283121 0.338919
N  -6.917242 0.668087 -0.907914
C  2.773938 0.098877 0.521776
C  4.017152 -0.126764 -0.367788
C  1.438086 -0.146493 -0.215416
C  5.350912 0.120561 0.372552
C  0.198932 0.068334 0.682506
C  6.597024 -0.115168 -0.510496
C  -1.138707 -0.171897 -0.054016
C  7.929545 0.128773 0.23326
C  -2.370354 0.036477 0.860614
C  9.17699 -0.111096 -0.647572
C  -3.691538 -0.193997 0.109794
C  10.503036 0.130231 0.105903
C  -6.597739 -0.138801 0.05332
C  -8.538803 -1.629004 -0.402884
C  -6.247217 1.945698 -1.151516
H  2.789156 1.136699 0.916006
H  2.831351 -0.569467 1.406572
H  3.960829 0.539972 -1.25386
H  4.003357 -1.165472 -0.75993
H  1.376039 0.527759 -1.095298
H  1.425715 -1.181906 -0.616047
H  5.367532 1.161274 0.759163
H  5.402978 -0.541215 1.262664
H  0.260502 -0.609298 1.55959
H  0.213558 1.102016 1.086641
H  6.579578 -1.155571 -0.898129
H  6.547401 0.547761 -1.399922
H  -1.151824 -1.203508 -0.463406
H  -1.204939 0.512173 -0.925581
H  7.949814 1.169736 0.619208
H  7.979061 -0.532616 1.123854
H  -2.30744 -0.654039 1.725332
H  -2.356168 1.065033 1.272746
H  9.154241 -1.150259 -1.035253
H  9.128669 0.552074 -1.535604
H  -3.758373 -1.221862 -0.285063
H  -3.805762 0.519285 -0.723734
H  10.589549 -0.542705 0.980053
H  11.378851 -0.047159 -0.545269
H  10.563389 1.17064 0.477846
H  -6.941649 -1.914027 1.041901
H  -9.23598 -0.77231 -0.409965
H  -9.024534 -2.492827 0.081826
H  -8.314762 -1.879141 -1.457554
H  -7.01027 2.736077 -1.279084
H  -5.561574 2.250359 -0.331108
H  -5.671438 1.899347 -2.097455
