program: Gaussian 09
title: 000079261
version: EM64L-G09RevD.01
frameworkgroup: C1[X(C10H18O2)]
method: RPBEPBE
basis: SDD
operation: Freq
keyword: #pfreq=noraman
keyword: PBEPBE/SDD
title: #p freq=noraman PBEPBE/SDD
converged: YES YES NO NO
title: Mulliken charges:
elementType: O O C C C C C C C C C C H H H H H H H H H H H H H H H H H H
charge: -0.206918 -0.210074 -0.039038 -0.527677 0.219182 -0.609066 -0.714672 -0.692396 -0.477821 0.211280 -0.352470 -0.689462 0.207122 0.241403 0.219094 0.248723 0.255251 0.200322 0.265288 0.214770 0.212835 0.225487 0.222069 0.220362 0.285414 0.216248 0.215038 0.204916 0.221650 0.213138
chargesum: 0.00000
title: Mulliken charges with hydrogens summed into heavy atoms:
elementType: O O C C C C C C C C C C
charge: -0.206918 -0.210074 0.168084 -0.067180 0.219182 -0.105093 -0.034291 -0.032004 0.027955 0.211280 0.078817 -0.049757
polarizability: 1.33273171e+02 1.79108262e+00 1.09348722e+02 -1.49307574e+00 -4.05248386e-01 9.83821973e+01
1716.lowfreq: -20.7435 -9.3332 -0.0008 0.0003 0.0004 8.9443 12.2109 32.6515 62.8317
frequency: -8.6146 32.3242 62.8147 70.8888 89.3009 98.9820 135.5277 178.3128 186.1550 210.2564 234.0678 251.8784 275.4244 327.6031 355.1238 358.2440 402.3021 447.8427 470.7971 537.9974 598.4345 633.6418 727.6478 780.2382 804.7302 824.7587 875.5623 896.7600 904.8835 926.6624 933.1086 957.6296 964.0944 1019.1717 1054.8058 1069.7079 1092.3058 1102.5878 1127.6404 1147.4840 1173.4469 1186.4648 1216.0296 1234.2359 1252.4765 1275.5356 1286.3389 1299.2044 1326.4633 1344.0919 1360.6535 1390.0168 1393.2873 1408.0834 1432.3290 1440.6107 1451.7252 1464.4330 1471.4838 1476.1124 1478.9343 1483.6548 1484.9974 1496.7460 1602.9557 1627.4955 2947.4755 2966.2468 2970.2518 2972.6566 2978.6463 2989.7766 2990.4404 2999.8906 3004.0009 3044.3366 3060.5045 3064.7634 3071.3829 3072.9610 3074.9696 3078.4284 3079.9301 3108.9459
redmass: 3.3851 4.4204 3.0299 1.7841 2.9961 3.7670 4.0246 2.8571 3.9593 1.1895 1.1011 1.0612 3.2584 3.3847 2.2194 2.6879 1.9601 2.7564 3.0079 3.5541 2.6301 3.5038 1.3113 2.9943 2.3806 2.7776 1.5657 1.9695 1.9027 1.3499 1.6411 2.0660 1.5460 1.6831 2.4088 1.4347 2.2704 1.6159 1.9872 2.1400 1.8011 1.9912 1.3311 1.3736 1.3512 1.2728 1.1990 1.5234 1.5094 1.3719 1.7673 1.2105 1.2161 1.2080 1.0957 1.0983 1.1036 1.0454 1.0596 1.0578 1.0423 1.0443 1.0716 1.0515 7.9787 7.9522 1.0612 1.0742 1.0425 1.0359 1.0363 1.0865 1.0715 1.0610 1.0636 1.1004 1.1001 1.1009 1.1006 1.1003 1.1003 1.0999 1.0996 1.0980
irintensity: 1.0101 1.4859 2.4782 0.5274 1.9516 6.0629 1.9501 7.4203 1.8647 1.7998 0.2449 0.1495 4.0314 1.1182 0.2150 0.0086 0.5273 0.9007 0.9909 18.7842 10.5963 4.5587 3.9810 0.4944 9.9410 4.7915 1.5093 12.8348 9.7726 1.5748 2.2157 0.4808 0.0882 25.3670 6.2301 6.4920 50.7890 7.3639 8.4056 189.7584 2.6132 20.9021 7.7706 32.9456 49.4132 33.2053 18.0806 38.8137 2.7343 3.9663 43.3718 23.3965 5.8283 14.3458 29.2015 29.6176 8.7608 4.3485 4.7386 2.1798 12.3998 22.5193 14.1960 10.2501 181.5875 42.0327 9.3196 20.7974 40.4279 35.6706 22.1693 19.9003 12.6534 16.6153 7.1460 0.0899 17.1160 29.5539 18.3849 62.4864 56.7866 52.3263 31.6897 8.5282
temp: 298.150 k
press: 1.00000 atm
elementType: 8 8 6 6 6 6 6 6 6 6 6 6 1 1 1 1 1 1 1 1 1 1 1 1 1 1 1 1 1 1
symmnumber: 1
zpe: 680083.7 jmol-1
zpe.correction: 0.259030 hartree
zpe.thermalcorrener: 0.273177 hartree
zpe.thermalcorrenthalpy: 0.274121 hartree
zpe.thermalcorrgfe: 0.217607 hartree
zpe.sumelectzpe: -541.332426 hartree
zpe.sumelectthermal: -541.318279 hartree
zpe.sumelectthermalent: -541.317335 hartree
zpe.sumelectthermalfe: -541.373850 hartree
dipole: 1.1592 -0.7089 -1.8115
dipole: 2.2645
quadrupole: -65.9635 -85.9278 -70.6429
quadrupole: 1.4282 0.1916 2.8538
quadrupole: 8.2146 -11.7497 3.5351 1.4282 0.1916 2.8538
hfenergy: -541.5914565 hartree
pointgroup: C01 [X(C10H18O2)]
dipole: -0.4190736 0.482373 0.6208339 debye
polarizability: 133.1954249|-2.9674064|101.6111421|-0.5655714|-4.8544153|106.1975234 unknown
InChI: InChI=1S/C10H18O2/c1-4-5-9(11)7-10(12)6-8(2)3/h8H,4-7H2,1-3H3
charge 0 multiplicity 1
30 atoms
O  -0.260903 -0.715419 1.723244
O  0.809583 1.581481 -1.329383
C  -2.98276 0.154521 -0.129053
C  -2.364071 0.427719 1.291764
C  -0.844036 0.340688 1.35289
C  -0.024362 1.593707 0.956423
C  -2.746759 1.304163 -1.138252
C  -2.517344 -1.204075 -0.702043
C  2.291075 0.568073 0.33926
C  1.029506 1.277253 -0.126051
C  3.24446 0.148829 -0.79449
C  4.525672 -0.522186 -0.256369
H  -4.075649 0.090897 0.055282
H  -2.757213 -0.33491 1.988883
H  -2.696071 1.428067 1.63159
H  0.492155 1.934447 1.875217
H  -0.688401 2.39304 0.594844
H  -3.075448 2.277879 -0.726571
H  -1.685052 1.392666 -1.430397
H  -3.329491 1.119345 -2.059779
H  -3.07726 -1.443215 -1.624678
H  -1.44213 -1.183314 -0.958199
H  -2.672505 -2.025471 0.020905
H  2.808966 1.240503 1.058159
H  1.964964 -0.302218 0.94878
H  3.502685 1.035711 -1.40304
H  2.712555 -0.540815 -1.476722
H  5.093461 0.165172 0.399508
H  5.193437 -0.82453 -1.083451
H  4.287737 -1.427908 0.332727
