program: Gaussian 09
title: 000079233
version: EM64L-G09RevD.01
frameworkgroup: C1[X(C10H12O4)]
method: RPBEPBE
basis: SDD
operation: Freq
keyword: #pfreq=noraman
keyword: PBEPBE/SDD
title: #p freq=noraman PBEPBE/SDD
converged: YES YES NO NO
title: Mulliken charges:
elementType: O O O O C C C C C C C C C C H H H H H H H H H H H H
charge: -0.268185 -0.249783 -0.426390 -0.190137 0.332912 0.333072 -0.360811 -0.341660 -0.337527 -0.345658 -0.240964 -0.685546 -0.335724 0.160737 0.243590 0.253050 0.240493 0.258736 0.205451 0.205373 0.206180 0.232429 0.232357 0.244452 0.244494 0.389059
chargesum: 0.00000
title: Mulliken charges with hydrogens summed into heavy atoms:
elementType: O O O O C C C C C C C C C C
charge: -0.268185 -0.249783 -0.037331 -0.190137 0.332912 0.333072 -0.117221 -0.088610 -0.097034 -0.086922 0.169860 -0.014579 0.153222 0.160737
polarizability: 1.90382628e+02 -1.91727218e+00 1.19945138e+02 -5.94498711e-02 -6.91389538e-02 6.36872752e+01
1716.lowfreq: -2.7057 -2.2858 -0.0006 0.0003 0.0008 7.4752 26.7995 33.9620 64.6069
frequency: 26.7236 33.9302 64.6057 73.1368 108.1910 133.3075 144.3396 165.1710 206.3055 235.6005 287.2070 342.0550 357.6870 417.0797 418.3831 488.7845 513.7411 515.7879 530.2922 598.5202 628.4756 630.5781 715.0486 736.8315 786.8433 811.0880 827.9732 832.9235 879.8301 902.7289 903.5700 958.8216 995.1404 1009.8164 1011.0662 1038.4348 1060.0220 1111.5732 1118.1349 1136.4282 1176.9478 1201.5179 1204.5254 1236.1545 1256.8229 1260.8616 1299.9365 1362.3916 1372.6629 1390.6285 1399.8853 1426.1290 1454.0914 1459.6523 1476.7317 1486.3670 1499.0038 1589.0522 1625.7177 1706.8943 2948.4076 2952.5550 2997.3223 3004.8027 3004.9634 3094.4229 3106.1601 3146.8466 3157.2929 3167.9962 3178.3057 3528.4628
redmass: 8.1403 4.5111 4.9661 5.4144 1.6866 2.4812 4.3610 6.2344 6.2512 1.2267 6.5006 3.7099 7.0251 3.0429 4.9713 5.0531 1.7719 2.2559 5.3047 5.4539 1.5264 6.9963 3.5015 5.1284 1.3262 5.8802 1.1322 1.4961 4.0971 1.3880 3.2733 1.3373 2.9563 1.8733 3.8896 2.8448 2.9353 1.5034 1.7021 1.4401 1.2582 2.8548 1.0768 5.8530 1.7088 1.1413 1.2969 1.7122 1.7963 2.1900 1.3858 3.6456 1.1295 1.0399 1.0913 1.2482 1.7334 7.7298 6.3960 9.2770 1.0552 1.0553 1.0361 1.1034 1.1071 1.0989 1.1013 1.0870 1.0880 1.0954 1.0976 1.0643
irintensity: 0.0046 0.0978 0.1329 0.6305 0.3518 7.6545 2.6472 6.5736 0.5154 1.4846 1.2120 1.2463 0.0451 0.0521 7.9175 2.1228 58.6018 4.0771 37.2747 8.7027 131.8517 0.0555 0.0364 32.6119 33.8437 5.0288 17.8551 57.5313 3.2916 0.2077 30.8193 0.0097 12.8046 2.0268 400.9407 73.0696 66.9821 4.1822 16.7025 4.5392 35.7725 457.3898 0.5673 5.7572 10.5125 0.0279 5.0487 21.4008 9.7534 1.1040 43.0199 2.1815 111.3645 11.7727 40.0140 102.2621 150.5747 8.3211 1.4366 218.8516 35.0089 56.3043 26.4646 7.1009 54.6130 29.2514 34.9615 23.5437 3.8318 11.4871 2.2253 34.2064
temp: 298.150 k
press: 1.00000 atm
elementType: 8 8 8 8 6 6 6 6 6 6 6 6 6 6 1 1 1 1 1 1 1 1 1 1 1 1
symmnumber: 1
zpe: 531917.7 jmol-1
zpe.correction: 0.202597 hartree
zpe.thermalcorrener: 0.216679 hartree
zpe.thermalcorrenthalpy: 0.217623 hartree
zpe.thermalcorrgfe: 0.159808 hartree
zpe.sumelectzpe: -688.082478 hartree
zpe.sumelectthermal: -688.068396 hartree
zpe.sumelectthermalent: -688.067452 hartree
zpe.sumelectthermalfe: -688.125267 hartree
dipole: 1.0871 -4.1245 0.0003
dipole: 4.2654
quadrupole: -67.2465 -80.4977 -84.1637
quadrupole: 4.8866 0.0197 -0.0020
quadrupole: 10.0561 -3.1951 -6.8611 4.8866 0.0197 -0.0020
hfenergy: -688.2850749 hartree
pointgroup: C01 [X(C10H12O4)]
dipole: 0.4160177 1.6008056 0.28367 debye
dipolederiv: -1.9261939 -0.3447771 0.0226649 -0.3938847 -0.4076555 -0.003175 0.0116886 -0.0055983 -0.2823445 -1.8521179 0.1740383 0.120272 0.2348504 -0.2941798 -0.0180847 0.130874 -0.0156628 -0.2769376 -0.8513576 0.5224146 0.1231968 0.5267514 -0.8673567 -0.1125196 0.1251627 -0.1127077 -0.4690942 -0.7413016 -0.2440094 -0.0203487 -0.007533 -0.8663537 -0.1092852 0.0255732 -0.0952187 -0.3106995 1.5971851 0.2275566 -0.0376878 -0.0528926 -0.0791431 -0.0263644 -0.0890406 -0.041279 0.0727492 1.5709697 -0.0558067 -0.0926423 0.1803163 -0.0733676 -0.0381308 -0.0457006 -0.0246781 0.0700358 -0.2547894 -0.1691465 -0.0293042 0.2948682 0.0332558 0.0290042 0.0583367 0.0539568 -0.1945812 -0.2034874 0.0520635 0.0117778 -0.233245 0.0749408 0.0586327 -0.0425662 0.0432977 -0.1583283 -0.1953435 0.1544692 0.0296962 -0.2611915 0.0185062 0.0549588 -0.0497914 0.0322773 -0.1877031 -0.1713427 -0.0866965 -0.0155733 0.1731785 0.084198 0.037483 0.0339574 0.0514302 -0.1538882 0.7731005 0.2168923 0.0215672 0.651251 0.5185535 -0.013509 0.1035945 0.0097264 0.4023661 -0.1515836 0.0045091 0.0116954 -0.0333761 0.0617456 0.0034998 0.0042905 0.0013009 0.0546308 0.368982 -0.2235887 -0.0392321 -0.860392 0.2991364 0.0285807 -0.1610117 -0.006728 0.4097036 1.5529275 -0.1428052 -0.1065356 -0.2309295 1.4580337 0.2535645 -0.1254037 0.2485225 0.2556793 0.0396259 -0.0811894 -0.0087277 -0.1094738 -0.0369702 -0.0324596 -0.0142305 -0.03416 0.158804 0.040149 0.0827854 0.0225408 0.0752118 0.0031671 -0.0351193 0.0209534 -0.0354684 0.1589335 0.0156442 0.0899676 0.0251298 0.1251994 -0.0172588 -0.0418239 0.0318204 -0.0398642 0.158076 0.0613955 -0.0764464 -0.0087036 -0.0706141 -0.0010676 -0.0287095 -0.0074429 -0.028327 0.1651114 -0.0283461 0.0706015 -0.0708767 -0.0846258 -0.1033897 0.0911721 -0.0541599 0.1104462 -0.0509886 -0.016467 0.0290106 0.081608 -0.106462 -0.0293193 -0.0698881 0.0100657 -0.1047694 -0.1374516 -0.0357661 -0.0956024 -0.0102459 -0.1430277 -0.0839291 -0.0303803 -0.0192847 -0.0329173 0.1084176 0.0726792 0.0279566 -0.0265211 0.1014033 0.0012284 0.1101801 -0.0493809 0.1095641 -0.0161861 0.0808831 0.008751 0.0190612 0.067992 0.0760058 -0.0811363 0.0674848 -0.0734152 -0.0999592 0.0369521 -0.0206189 -0.0394214 0.1431684 0.0158149 -0.0770674 0.0426478 -0.0810292 -0.0694988 0.0369893 -0.0207946 0.0221457 0.1600542 -0.0474585 0.068847 0.0061792 0.0923157 -0.0080879 0.1806138 -0.0995346 -0.0055355 -0.1465971 0.2628632 -0.0182699 -0.0146159 -0.0210143 0.4012417 unknown
polarizability: 189.98646|3.6279464|118.066259|-6.2351517|10.1542111|65.9623222 unknown
InChI: InChI=1S/C10H12O4/c1-2-13-8-3-5-9(6-4-8)14-7-10(11)12/h3-6,11H,2,7H2,1H3
charge 0 multiplicity 1
26 atoms
O  3.584028 -0.267682 -0.341757
O  -2.039712 -0.564175 -0.097845
O  -5.098189 1.31076 0.442911
O  -4.790882 -0.956047 -0.007709
C  2.181443 -0.220489 -0.259199
C  -0.640128 -0.366097 -0.135684
C  1.424157 0.944108 0.002473
C  1.519097 -1.460988 -0.459857
C  0.00956 0.87154 0.064386
C  0.120279 -1.533877 -0.398556
C  4.323311 0.992654 -0.143608
C  5.806749 0.662422 -0.286151
C  -2.852603 0.602994 0.173166
C  -4.312407 0.173521 0.179054
H  1.909045 1.911642 0.160766
H  2.122206 -2.351281 -0.66113
H  -0.553151 1.787703 0.268388
H  -0.406239 -2.480671 -0.550054
H  4.0009 1.734247 -0.904277
H  4.097164 1.399875 0.864164
H  6.415339 1.573905 -0.143336
H  6.112313 -0.084448 0.466256
H  6.019482 0.252067 -1.287957
H  -2.614421 1.054223 1.159288
H  -2.720717 1.388985 -0.599956
H  -6.059422 1.053709 0.451522
