program: Gaussian 09
title: 000079224
version: EM64L-G09RevD.01
frameworkgroup: C1[X(C7H6BrNO2)]
method: RPBEPBE
basis: SDD
operation: Freq
keyword: #p
keyword: freq=noraman
keyword: PBEPBE/SDD
title: #p freq=noraman PBEPBE/SDD
converged: NO YES NO NO
title: Mulliken charges:
elementType: Br O O N C C C C C C C H H H H H H
charge: 0.096484 -0.210229 -0.181838 0.022484 0.486764 -0.498881 0.489644 -0.408858 -0.374929 -0.142217 -0.795409 0.297567 0.248143 0.258380 0.238527 0.228350 0.246017
chargesum: 0.00000
title: Mulliken charges with hydrogens summed into heavy atoms:
elementType: Br O O N C C C C C C C
charge: 0.096484 -0.210229 -0.181838 0.022484 0.486764 -0.201314 0.489644 -0.160715 -0.374929 0.116163 -0.082515
polarizability: 1.60304136e+02 6.00443522e-01 1.20383054e+02 -4.15351194e-01 3.72004702e-02 4.34291751e+01
1716.lowfreq: -37.9515 -30.6897 -9.5389 -0.8978 -0.0003 -0.0003 -0.0002 8.6411 86.1875
frequency: -37.9154 -30.5808 86.1845 158.9719 172.4822 214.6286 270.6887 294.6289 353.6423 398.7738 428.7101 503.3071 520.0388 604.6557 658.1033 669.4952 723.3912 746.2149 828.5698 884.0950 925.2624 976.1887 1004.8980 1007.9860 1052.7624 1098.2231 1150.3248 1191.9906 1222.5965 1262.8830 1358.9246 1370.1205 1401.8460 1402.4599 1465.2483 1468.7778 1474.1640 1566.0102 1605.6675 2984.5170 3067.3033 3095.8763 3140.4877 3166.7304 3170.6942
redmass: 15.5058 1.0227 4.3521 4.6856 20.5259 4.3560 11.6162 4.3794 4.7757 7.1728 3.4576 5.4843 3.8522 6.1271 7.7913 4.3310 6.1269 9.9419 1.2979 5.0104 1.3612 1.3630 1.4572 6.9618 1.5714 2.2051 1.4830 13.0389 2.1452 1.5596 3.2105 10.4156 3.3481 1.3968 2.9387 1.0998 1.0625 6.2008 6.5236 1.0387 1.0955 1.1001 1.0898 1.0915 1.0958
irintensity: 0.0024 0.8415 0.3413 0.0143 0.5460 0.7106 3.2421 0.2975 0.1511 3.0555 1.3139 0.2180 24.6337 10.4609 7.6828 0.5047 2.8576 21.7837 33.7187 9.2258 7.4061 2.3111 2.5554 46.8293 21.0000 24.0384 6.0145 244.1118 11.3456 5.8642 10.8876 70.0817 3.7809 26.9930 123.8270 10.3729 14.5226 17.2450 0.9930 21.3334 15.9781 13.1925 7.7620 1.3503 8.4451
temp: 298.150 k
press: 1.00000 atm
elementType: 35 8 8 7 6 6 6 6 6 6 6 1 1 1 1 1 1
symmnumber: 1
zpe: 305936.1 jmol-1
zpe.correction: 0.116525 hartree
zpe.thermalcorrener: 0.125235 hartree
zpe.thermalcorrenthalpy: 0.126180 hartree
zpe.thermalcorrgfe: 0.081349 hartree
zpe.sumelectzpe: -488.116730 hartree
zpe.sumelectthermal: -488.108020 hartree
zpe.sumelectthermalent: -488.107075 hartree
zpe.sumelectthermalfe: -488.151906 hartree
dipole: -4.0781 -4.5540 0.0539
dipole: 6.1133
quadrupole: -62.7702 -78.5524 -73.7917
quadrupole: -0.1199 -0.2359 0.0016
quadrupole: 8.9345 -6.8477 -2.0869 -0.1199 -0.2359 0.0016
hfenergy: -488.2332549 hartree
pointgroup: C01 [X(C7H6Br1N1O2)]
dipole: -2.3134927 -0.657383 0.0189393 debye
dipolederiv: -0.2999249 0.3408864 -0.0017264 0.309075 -0.2770841 0.001592 -0.0024194 0.0021975 0.0336017 -0.4900152 -0.1143294 -0.000348 -0.0545621 -0.9094878 0.0046346 -0.001066 0.0043711 -0.2293548 -0.7620304 -0.0064339 -0.0028006 0.0248147 -0.4485203 0.0020554 -0.0032494 0.0017188 -0.2018399 1.3806875 0.4503099 0.0027003 0.2201539 1.3730943 -0.008177 0.0038287 -0.0051145 0.1840316 0.3156182 -0.3942931 -0.0131819 -0.3154395 -0.0888682 0.0086657 -0.0671263 0.0330288 -0.0170759 -0.0355272 0.3183026 0.0005389 -0.0343992 -0.1148744 0.0067272 0.0093303 0.0077765 -0.1299094 -0.5251056 -0.2339282 -0.0027184 -0.2510293 -0.2908451 -0.0006292 0.0038758 -0.003229 0.1184287 0.0872702 0.0451554 -0.0017532 0.0838285 0.1382788 -0.006058 0.0056149 -0.0104477 -0.1319741 0.6856998 -0.6957806 0.0082836 -0.1901677 0.5122735 -0.0042273 0.0035877 -0.0041233 -0.1278984 -0.4463625 0.2342246 -0.0017049 0.1248562 0.0213029 0.0048791 0.0026866 -0.0008102 -0.0778886 -0.0786099 0.1044884 0.0131133 0.1444547 -0.0310675 -0.0044589 0.1009825 -0.0524633 0.0481329 0.1334816 0.0171723 -0.0027359 0.0352711 0.0465281 0.0005934 -0.0034324 0.0046738 0.1638737 -0.0689226 -0.0632391 -0.0024225 -0.0553854 0.0624329 0.0023972 -0.0065771 -0.0001096 0.1529489 0.0874721 0.0093768 -0.001292 -0.0073726 -0.0445766 0.0002326 -0.0028836 0.000736 0.1550581 0.05266 -0.0347417 0.0385154 0.0285651 -0.0402246 0.1030644 -0.0265173 0.1100606 0.0467559 -0.0599054 -0.0324004 -0.0531828 -0.1254067 0.0123212 -0.0577003 -0.0804315 -0.0188925 0.0896614 0.0235144 0.05523 0.0207149 0.0627433 0.0793168 -0.0535907 0.0637965 -0.0693731 -0.0765517 unknown
polarizability: 149.4540231|-17.7715651|131.2344208|-0.0374484|-0.133122|43.4279212 unknown
InChI: InChI=1S/C7H6BrNO2/c1-5-2-3-6(8)7(4-5)9(10)11/h2-4H,1H3
charge 0 multiplicity 1
17 atoms
Br 1.949836 -2.403068 0.016486
O  1.595299 2.316377 -0.011149
O  2.851765 0.423561 0.009458
N  1.716747 1.027592 -0.000345
C  -2.00767 0.344451 -0.012027
C  -0.744374 0.969934 -0.01071
C  0.459148 0.221931 -0.000032
C  -2.039712 -1.073818 -0.009597
C  0.416058 -1.199434 0.005999
C  -0.850451 -1.829291 0.001144
C  -3.282492 1.165869 0.001697
H  -0.653412 2.060035 -0.018241
H  -3.002135 -1.597715 -0.016794
H  -0.897778 -2.92206 0.001973
H  -3.187549 2.069613 -0.624862
H  -4.144025 0.582575 -0.365274
H  -3.523052 1.503251 1.027974
