program: Gaussian 09
title: 000079208
version: EM64L-G09RevD.01
frameworkgroup: C1[X(C8H18N2O)]
method: RPBEPBE
basis: SDD
operation: Freq
keyword: #p
keyword: freq=noraman
keyword: PBEPBE/SDD
title: #p freq=noraman PBEPBE/SDD
converged: YES YES NO NO
title: Mulliken charges:
elementType: O N N C C C C C C C C H H H H H H H H H H H H H H H H H H
charge: -0.451752 -0.074130 -0.063346 -0.347245 -0.357209 -0.388523 -0.377808 -0.324785 -0.390780 -0.614729 -0.331612 0.209160 0.182351 0.185013 0.202168 0.205230 0.186864 0.186316 0.203179 0.169259 0.196371 0.231339 0.222390 0.221323 0.186755 0.221917 0.186704 0.184320 0.341258
chargesum: 0.00000
title: Mulliken charges with hydrogens summed into heavy atoms:
elementType: O N N C C C C C C C C
charge: -0.110493 -0.074130 -0.063346 0.044266 0.029973 0.003571 0.011687 0.040846 0.062949 0.015266 0.039412
polarizability: 1.32079953e+02 -9.28960894e-01 9.77243394e+01 -1.90626936e+00 4.35770439e-02 8.25283564e+01
1716.lowfreq: 0.0003 0.0006 0.0008 1.7854 13.9298 26.9969 45.9175 49.9140 79.4505
frequency: 44.5094 49.6703 79.3095 110.9278 146.7913 218.3461 227.9168 244.6383 254.4502 280.3253 282.4428 326.8412 355.2807 394.1692 454.4672 470.5216 500.5676 614.5428 751.1985 778.0417 785.7269 848.8744 879.1763 922.3710 968.7700 1010.1778 1019.5430 1024.4577 1049.9772 1058.6252 1073.9895 1083.8236 1112.0040 1130.8231 1142.6825 1150.0398 1154.9316 1185.2307 1194.8669 1208.8108 1237.7638 1272.5078 1277.8405 1285.4787 1292.3443 1299.9232 1311.8866 1337.1832 1351.5818 1372.8320 1375.6106 1396.1687 1415.2453 1428.8194 1452.3282 1452.9550 1459.4488 1462.5309 1471.1200 1473.7628 1478.0274 1480.4643 1491.4758 2820.9544 2844.2349 2845.8338 2857.4700 2859.9969 2872.3157 2924.3623 2971.3642 2993.4005 3010.8345 3015.9629 3021.3530 3023.9197 3027.9782 3049.7737 3074.1295 3078.2553 3564.3528
redmass: 2.1439 3.0103 3.7841 3.3612 2.5098 1.5594 1.6594 2.2040 3.3798 1.0970 2.3045 2.1091 2.5080 1.9717 4.1355 3.3834 2.8538 2.0609 4.1123 2.9035 1.1026 1.5259 1.2315 2.0265 6.6508 2.4234 2.5005 2.6780 1.6130 2.0220 1.8570 1.7998 1.6212 1.8450 2.4238 2.2738 2.8103 1.3137 1.0832 1.2992 1.9050 1.3621 1.2789 1.3921 1.2736 1.3404 1.3488 1.2942 1.3885 1.4855 1.3785 1.4625 1.4395 1.1720 1.0801 1.0780 1.0705 1.0832 1.0796 1.0982 1.0936 1.0537 1.0921 1.0707 1.0710 1.0621 1.0687 1.0674 1.0661 1.0544 1.1068 1.0855 1.0604 1.0725 1.0903 1.0881 1.0889 1.0880 1.1009 1.1039 1.0664
irintensity: 8.0727 2.3286 1.7952 2.4282 1.9416 1.6872 3.1651 3.7562 1.3014 147.8180 1.0805 20.2663 3.1984 0.9523 7.0506 10.8927 7.9192 0.6068 1.5877 16.5424 4.9666 0.0125 0.6481 8.2226 91.2032 20.5195 6.3854 15.8817 7.9208 4.7748 0.7642 5.4377 22.2372 1.9796 14.9555 32.1675 41.3588 2.4564 1.1522 17.3506 24.0732 7.4797 11.2832 12.9620 19.0726 14.6774 5.5482 8.6887 12.5131 0.5512 8.7072 5.3986 8.5751 1.4991 1.5585 0.0292 31.1976 9.4685 3.5751 12.5317 1.7879 8.8313 7.5195 76.5749 97.1374 52.5971 7.6546 13.3679 380.4330 77.4151 58.5540 22.6730 24.7461 46.4524 21.0044 100.7818 37.4587 36.6266 35.4316 48.3535 2.2250
temp: 298.150 k
press: 1.00000 atm
elementType: 8 7 7 6 6 6 6 6 6 6 6 1 1 1 1 1 1 1 1 1 1 1 1 1 1 1 1 1 1
symmnumber: 1
zpe: 677826.0 jmol-1
zpe.correction: 0.258170 hartree
zpe.thermalcorrener: 0.270720 hartree
zpe.thermalcorrenthalpy: 0.271664 hartree
zpe.thermalcorrgfe: 0.219035 hartree
zpe.sumelectzpe: -499.404132 hartree
zpe.sumelectthermal: -499.391583 hartree
zpe.sumelectthermalent: -499.390639 hartree
zpe.sumelectthermalfe: -499.443268 hartree
dipole: -0.3682 1.6302 0.6374
dipole: 1.7887
quadrupole: -58.8687 -67.8371 -72.7014
quadrupole: -8.0342 -5.8119 -1.3695
quadrupole: 7.6004 -1.3681 -6.2323 -8.0342 -5.8119 -1.3695
hfenergy: -499.6623024 hartree
pointgroup: C01 [X(C8H18N2O1)]
dipole: -0.1349328 -0.6369991 -0.2669357 debye
polarizability: 132.023345|1.3188769|97.7417532|2.2591002|0.4400631|82.5675511 unknown
InChI: InChI=1S/C8H18N2O/c1-9-4-6-10(7-5-9)3-2-8-11/h11H,2-8H2,1H3
charge 0 multiplicity 1
29 atoms
O  -4.838743 0.699181 0.332427
N  -0.021678 -0.352424 0.102785
N  2.807854 0.238324 -0.205319
C  0.439742 0.929971 -0.48724
C  0.970197 -1.423004 -0.173793
C  1.822684 1.311556 0.065569
C  2.349597 -1.040507 0.386054
C  -1.38255 -0.742497 -0.340474
C  -2.481604 0.216296 0.162689
C  4.170458 0.602151 0.225007
C  -3.884259 -0.329558 -0.117786
H  -0.278451 1.728361 -0.230985
H  0.502683 0.862328 -1.603995
H  1.072243 -1.615045 -1.272647
H  0.624722 -2.357551 0.307686
H  2.168364 2.242065 -0.423264
H  1.726201 1.512113 1.163806
H  2.278902 -0.975638 1.502593
H  3.081619 -1.831132 0.13401
H  -1.441839 -0.824075 -1.45944
H  -1.577758 -1.756236 0.064514
H  -2.357674 0.370059 1.250027
H  -2.402076 1.205695 -0.324291
H  4.875912 -0.201732 -0.053173
H  4.257506 0.771594 1.329051
H  4.488247 1.527826 -0.288104
H  -4.042718 -1.282633 0.433761
H  -4.007552 -0.530754 -1.205477
H  -5.763729 0.378966 0.18181
