program: Gaussian 09
title: 000079182
version: EM64L-G09RevD.01
frameworkgroup: C1[X(C13H25NO2)]
method: RPBEPBE
basis: SDD
operation: Freq
keyword: #p
keyword: freq=noraman
keyword: PBEPBE/SDD
title: #p freq=noraman PBEPBE/SDD
converged: YES YES NO NO
title: Mulliken charges:
elementType: O O N C C C C C C C C C C C C C H H H H H H H H H H H H H H H H H H H H H H H H H
charge: -0.245083 -0.284652 -0.151787 -0.368623 -0.384860 -0.382218 -0.537470 -0.370762 -0.372735 -0.365871 0.242676 -0.353911 -0.290654 -0.302142 -0.356090 -0.696524 0.185415 0.184634 0.223676 0.216923 0.195292 0.194868 0.225440 0.228617 0.187681 0.187671 0.234899 0.229613 0.224264 0.265193 0.188635 0.188687 0.191150 0.220972 0.200593 0.223319 0.194154 0.194203 0.214658 0.210116 0.210036
chargesum: 0.00000
title: Mulliken charges with hydrogens summed into heavy atoms:
elementType: O O N C C C C C C C C C C C C C
charge: -0.245083 -0.284652 -0.151787 0.001426 0.055739 0.007943 -0.083413 0.004589 0.091777 0.123586 0.242676 0.023411 0.121467 0.121770 0.032267 -0.061714
polarizability: 2.02238933e+02 -4.08379646e+00 1.43565815e+02 -7.64556317e-01 3.29951370e+00 1.18062845e+02
1716.lowfreq: -12.9407 -5.9398 0.0002 0.0011 0.0015 6.6120 14.6159 35.4885 36.2842
frequency: 8.9038 34.3851 35.6079 44.6069 64.9652 86.0273 88.9952 101.6034 130.1594 140.1866 155.1042 164.3112 179.6515 226.0980 228.9431 274.0924 308.4672 340.1591 351.2666 394.7104 421.9205 453.4499 460.0614 510.2155 542.3599 562.5194 620.9732 719.6153 724.4858 744.8372 757.1421 792.1617 795.0883 831.7578 856.8672 887.9878 894.6729 929.6043 933.7932 990.6779 1002.1009 1011.2825 1017.0926 1027.1145 1048.2817 1050.2807 1070.3124 1075.0984 1080.3432 1083.3557 1098.7117 1109.1363 1122.3930 1182.1698 1185.1975 1191.4580 1200.5426 1219.9136 1220.6122 1252.6732 1257.3460 1261.7632 1273.2296 1276.9652 1284.2011 1288.0364 1291.3688 1295.3972 1322.4059 1328.0934 1340.5528 1348.1107 1352.6052 1355.1665 1358.3455 1365.4049 1388.4381 1410.7995 1443.8294 1446.4884 1452.2999 1454.2551 1459.6121 1461.1546 1461.7164 1464.3346 1469.8140 1475.9885 1476.6608 1483.4814 1488.0801 1583.7613 2944.0486 2944.6647 2949.4553 2953.0713 2956.7021 2958.8828 2960.8545 2967.5591 2970.6825 2971.1640 2981.2060 2982.5845 2988.1213 3000.5532 3001.5933 3005.7833 3020.8587 3036.9664 3064.9693 3067.7093 3069.7487 3079.8243 3081.7264 3089.2605 3096.1053
redmass: 3.5287 2.1393 3.7996 2.8490 4.6077 1.6580 3.3499 3.5093 2.0280 2.0628 2.0909 4.5219 3.1642 1.1448 2.5047 2.9057 2.7069 4.1889 4.4962 1.8747 3.8494 2.7520 3.1256 3.5481 2.6511 3.3796 2.3157 1.0622 1.0864 1.1482 4.3623 1.4312 2.8748 1.6708 1.2969 1.9497 2.5492 1.3059 2.9605 4.4427 1.1573 2.3517 3.2764 2.7759 2.8859 2.3145 3.5333 2.6099 2.3019 2.1299 1.5127 1.9033 2.7288 2.4315 1.7599 1.0766 1.5156 1.4380 1.4211 1.3872 1.3299 1.5240 1.2018 1.0251 1.1457 1.1105 1.2531 1.1738 1.3366 1.3221 1.2345 1.5495 1.3512 1.6843 1.6362 1.3077 1.2175 2.6989 1.1039 1.0831 1.0897 1.0943 1.0760 1.1013 1.0877 1.0715 1.0794 1.0429 1.0787 1.0874 1.0919 8.0674 1.0681 1.0593 1.0590 1.0591 1.0594 1.0680 1.0591 1.0587 1.0678 1.0366 1.0649 1.0968 1.0992 1.0773 1.0857 1.0976 1.1044 1.1046 1.1035 1.1007 1.0993 1.0962 1.0957 1.0986 1.0925
irintensity: 0.0976 0.4902 0.4861 0.0983 2.6728 0.0370 0.7818 0.1504 0.8136 0.0745 0.7769 1.9711 0.8944 0.0563 4.0039 17.9824 3.9706 2.1533 8.6563 1.0514 0.5169 0.2148 2.1461 1.1186 7.0429 18.6007 4.0586 16.3542 0.0918 4.8559 0.2335 4.3106 14.4461 0.3703 3.5630 3.0052 3.9587 0.0723 7.6934 12.1759 1.0906 11.6494 19.8199 24.2612 7.4412 30.4780 32.8854 5.5660 0.1489 0.8497 2.0675 3.0750 8.3303 8.9393 0.1320 0.6677 60.0759 64.5731 51.3958 7.2189 7.6782 47.8232 10.0020 0.2880 0.8208 0.5518 7.5019 3.2893 0.9832 3.6493 7.8074 1.3359 1.7576 0.3200 0.0666 1.3078 11.3215 129.7966 22.0963 5.0128 15.4944 6.5929 0.4761 6.1436 3.9020 0.4485 2.0444 12.2364 2.8816 3.2549 27.6912 245.8658 42.2465 13.2918 4.2996 0.7901 20.4301 47.4511 27.9046 144.6227 43.4661 35.7643 70.1599 3.3805 2.8847 17.7914 12.2424 10.6906 0.2740 110.3215 55.7375 113.3840 55.2297 40.4506 11.3657 36.1004 17.4255
temp: 298.150 k
press: 1.00000 atm
elementType: 8 8 7 6 6 6 6 6 6 6 6 6 6 6 6 6 1 1 1 1 1 1 1 1 1 1 1 1 1 1 1 1 1 1 1 1 1 1 1 1 1
symmnumber: 1
zpe: 954621.8 jmol-1
zpe.correction: 0.363596 hartree
zpe.thermalcorrener: 0.382361 hartree
zpe.thermalcorrenthalpy: 0.383305 hartree
zpe.thermalcorrgfe: 0.313087 hartree
zpe.sumelectzpe: -714.266312 hartree
zpe.sumelectthermal: -714.247547 hartree
zpe.sumelectthermalent: -714.246603 hartree
zpe.sumelectthermalfe: -714.316821 hartree
dipole: -0.3332 -2.9145 -0.5226
dipole: 2.9797
quadrupole: -107.5291 -104.8624 -97.6671
quadrupole: 0.0902 -1.1810 0.1154
quadrupole: -4.1762 -1.5095 5.6857 0.0902 -1.1810 0.1154
hfenergy: -714.6299082 hartree
pointgroup: C01 [X(C13H25N1O2)]
dipole: -0.1305342 -1.1397976 -0.2410587 debye
polarizability: 202.2429086|-4.0518959|143.3364544|-0.7741349|4.0736483|118.2882306 unknown
InChI: InChI=1S/C13H25NO2/c1-2-3-4-5-6-7-8-13(15)14-9-11-16-12-10-14/h2-12H2,1H3
charge 0 multiplicity 1
41 atoms
O  5.747249 -0.962748 0.347874
O  1.830129 2.01503 0.185281
N  3.207607 0.217332 -0.323802
C  -1.823551 -0.331783 -0.144236
C  -0.604177 0.613396 -0.072088
C  -3.171027 0.407616 0.01588
C  0.728394 -0.14097 -0.249412
C  -4.394543 -0.534908 -0.037096
C  3.486832 -1.191584 -0.666789
C  4.421822 1.059908 -0.232303
C  1.949098 0.784101 -0.111964
C  -5.744121 0.20179 0.117861
C  4.522751 -1.775206 0.32051
C  5.426833 0.424446 0.744205
C  -6.96577 -0.744475 0.070921
C  -8.310881 -0.002725 0.2276
H  -1.820013 -0.87449 -1.113645
H  -1.73853 -1.107665 0.646384
H  -0.592489 1.148146 0.895738
H  -0.685444 1.398126 -0.847854
H  -3.173469 0.958638 0.979371
H  -3.264025 1.175782 -0.779906
H  0.795935 -0.952896 0.504783
H  0.746098 -0.63853 -1.240931
H  -4.301986 -1.300261 0.7622
H  -4.389044 -1.089443 -0.999254
H  2.563578 -1.790566 -0.635042
H  3.900791 -1.244659 -1.695167
H  4.884825 1.14417 -1.236378
H  4.108278 2.062877 0.102887
H  -5.75062 0.759215 1.078019
H  -5.841369 0.964207 -0.683357
H  4.07965 -1.826946 1.339551
H  4.843719 -2.782226 0.005961
H  5.010671 0.4316 1.774539
H  6.389743 0.960293 0.730421
H  -6.958177 -1.300747 -0.888918
H  -6.866381 -1.506072 0.871452
H  -9.167101 -0.701315 0.189316
H  -8.356452 0.535241 1.193447
H  -8.447635 0.744104 -0.577359
