program: Gaussian 09
title: 000079138
version: EM64L-G09RevD.01
frameworkgroup: C1[X(C8H17Br)]
method: RPBEPBE
basis: SDD
operation: Freq
keyword: #pfreq=noraman
keyword: PBEPBE/SDD
title: #p freq=noraman PBEPBE/SDD
converged: YES YES NO NO
title: Mulliken charges:
elementType: Br C C C C C C C C H H H H H H H H H H H H H H H H H
charge: -0.082145 -0.380002 -0.355016 -0.436826 -0.343198 -0.339638 -0.357869 -0.699268 -0.694656 0.237766 0.212640 0.195663 0.220346 0.282970 0.192112 0.182596 0.229842 0.236771 0.193380 0.200131 0.227263 0.223939 0.216796 0.216622 0.208659 0.211124
chargesum: 0.00000
title: Mulliken charges with hydrogens summed into heavy atoms:
elementType: Br C C C C C C C C
charge: -0.082145 0.070403 0.060993 -0.153857 0.031510 0.126975 0.035642 -0.031270 -0.058252
polarizability: 1.12853374e+02 -6.03432638e+00 1.13352012e+02 -3.20039166e+00 4.37031375e+00 8.28967043e+01
1716.lowfreq: -8.6852 -0.0005 -0.0004 0.0002 8.2477 10.3456 38.3213 64.5247 85.9512
frequency: 37.9011 64.2702 85.8290 102.4082 123.9443 133.9903 176.7224 203.7579 223.6021 246.2591 286.8824 299.0931 353.5247 394.9760 538.4754 593.6758 726.9743 751.9299 790.9967 824.3307 854.2508 891.8910 943.3565 962.3663 1003.6563 1031.6022 1047.9995 1064.9680 1079.3286 1097.6818 1135.7029 1163.6859 1178.8736 1206.4520 1234.2397 1258.8177 1266.6961 1290.7856 1295.3431 1310.1728 1319.5397 1341.4439 1355.0395 1368.7040 1388.6783 1389.2983 1447.9451 1465.1505 1470.0035 1475.7219 1475.9134 1478.9483 1479.5941 1487.9016 1490.9328 2951.7189 2954.7258 2966.9528 2972.2306 2973.7963 2980.7169 2994.3071 3010.8752 3018.0320 3028.2180 3044.8834 3048.4620 3061.6202 3068.8544 3071.9318 3080.8414 3087.0278
redmass: 3.7491 1.6935 3.3576 2.4522 2.5070 1.8230 2.2600 2.0411 1.1357 1.7061 3.3295 2.3898 3.1644 2.8173 2.7600 2.8691 1.0724 1.1592 1.4019 1.5045 1.5779 1.8375 1.6909 1.3404 2.4153 2.8039 2.1438 1.4688 2.0792 1.6643 2.0208 1.9524 1.4828 1.4696 1.3256 1.2524 1.2307 1.0486 1.1257 1.3729 1.3291 1.4549 1.5750 1.4966 1.2164 1.2094 1.0746 1.0699 1.0711 1.0467 1.0428 1.0703 1.0550 1.0829 1.0834 1.0612 1.0633 1.0598 1.0366 1.0613 1.0357 1.0969 1.0611 1.0975 1.0975 1.0907 1.1022 1.0980 1.1008 1.0992 1.0991 1.1015
irintensity: 0.4649 0.0419 0.2114 0.1475 0.1335 0.1413 0.1865 1.2963 0.0094 1.1168 5.1797 0.9623 0.8192 0.1022 9.6061 22.2648 14.1530 1.6709 8.8515 0.1578 21.1907 6.4212 8.6693 2.7512 1.5371 3.3971 2.9133 4.9411 0.7857 9.4952 23.2109 3.7128 22.7294 3.9210 3.4197 2.4972 4.9775 0.2232 3.3410 2.9566 10.5849 0.7422 0.6544 1.5772 12.1848 12.9755 10.0689 0.5454 1.4800 5.3153 13.3229 15.5942 2.9268 29.0324 0.4849 1.7377 26.7824 12.8040 48.3933 63.8572 32.4718 4.4135 16.5993 8.5979 6.4064 12.4180 59.4549 1.6650 94.5266 51.7348 39.6713 70.8956
temp: 298.150 k
press: 1.00000 atm
elementType: 35 6 6 6 6 6 6 6 6 1 1 1 1 1 1 1 1 1 1 1 1 1 1 1 1 1
symmnumber: 1
zpe: 610259.5 jmol-1
zpe.correction: 0.232436 hartree
zpe.thermalcorrener: 0.244836 hartree
zpe.thermalcorrenthalpy: 0.245780 hartree
zpe.thermalcorrgfe: 0.192138 hartree
zpe.sumelectzpe: -327.750426 hartree
zpe.sumelectthermal: -327.738025 hartree
zpe.sumelectthermalent: -327.737081 hartree
zpe.sumelectthermalfe: -327.790724 hartree
dipole: -1.2698 2.5545 0.5439
dipole: 2.9041
quadrupole: -71.4396 -67.1031 -67.5438
quadrupole: 4.6509 0.7899 0.2722
quadrupole: -2.7441 1.5924 1.1517 4.6509 0.7899 0.2722
hfenergy: -327.9828614 hartree
pointgroup: C01 [X(C8H17Br1)]
dipole: 0.2236234 1.0915366 -0.2528798 debye
dipolederiv: -0.2427558 -0.0528218 0.035934 -0.1134018 -0.7125366 0.092832 0.0699416 0.1386555 -0.2279981 -0.057563 0.0202549 0.0120074 -0.1184666 -0.0703696 0.0511545 0.1434724 0.0600355 0.0221058 -0.0601546 -0.0227968 -0.0102722 -0.0613132 0.1542343 0.0057843 -0.0255758 0.0502669 0.0380133 0.2400591 0.0935344 -0.0758415 0.1990555 1.0072053 -0.181449 -0.1664182 -0.2449616 0.2291498 -0.0041795 -0.0204831 -0.0256895 -0.0053923 0.1835244 -0.0045632 -0.0556725 -0.0213076 0.086106 0.0664477 -0.0228678 0.0469366 0.002063 -0.1547557 -0.0206068 0.059074 0.1453837 0.0180603 0.0252842 -0.0165077 0.0002462 -0.0156981 0.1663016 0.004107 0.0419616 0.0136382 0.0984122 0.0940323 0.0496882 0.0182318 0.0130272 -0.0689988 0.0210466 0.0297387 -0.1264902 0.0620484 -0.0821916 -0.0179133 0.0220908 -0.014832 0.0952159 0.0017571 -0.0172855 -0.0053513 0.0629488 0.0252821 0.0449852 0.0505047 0.0539362 -0.0091593 -0.1310332 0.0020092 -0.0996001 -0.0303081 0.0111482 -0.0889894 0.0158566 0.0067735 -0.0967713 0.1314964 -0.0420927 0.1063594 0.0267005 0.0486848 0.028499 0.02154 0.0449363 -0.0751763 -0.1239333 0.0430775 -0.1129322 -0.0525153 0.0740812 0.0015247 0.0045064 0.0122218 -0.051025 0.1058168 0.0026063 0.0755257 -0.0065861 -0.0800232 -0.0170004 -0.06603 -0.0104446 -0.0667888 0.0635291 -0.0615925 0.0228787 -0.0704659 0.0233475 0.0257165 0.0192322 0.0366852 -0.0752915 -0.1367514 0.0307191 -0.1082245 -0.0501809 0.0336578 0.0012747 -0.0089094 -0.0157797 -0.0999144 0.1394473 0.005456 0.1123246 -0.0397327 -0.1337064 -0.0375922 0.0754984 -0.0474095 0.0326614 0.0219669 0.0549298 0.0025875 0.0659365 0.0353189 0.0159115 -0.1242165 0.0238164 0.0310516 0.0246713 -0.1088569 0.0023832 -0.0529005 0.013941 0.056693 0.0515293 0.0400418 -0.0759132 -0.1445859 0.0231808 -0.1140189 -0.0469276 0.0288765 -0.0379147 0.0218839 -0.0187229 -0.0963524 0.1443797 -0.0006085 0.1086881 -0.0283607 0.0510447 0.0767226 0.068375 0.0713524 -0.0781776 -0.085628 0.0881802 -0.1125887 -0.0232019 -0.1300329 -0.1059146 0.0426897 -0.0758038 0.0583012 0.0288451 0.0428133 0.0437611 0.0678026 0.0165144 0.0180743 -0.1084051 -0.0133006 0.0806986 -0.0012966 -0.1291079 0.0644524 -0.0918627 -0.1296466 -0.0188425 -0.1183618 -0.0152054 0.0978175 -0.005138 -0.1611088 -0.0094592 -0.0439508 0.0699313 0.0142974 0.0040166 -0.0397608 -0.102467 0.1298762 0.0530738 0.1260407 0.0024083 0.0626021 0.0124678 0.0266468 0.0616221 -0.0733142 -0.1317247 0.0780849 -0.118047 -0.0147012 unknown
polarizability: 109.8535815|4.9840798|115.9274187|-2.4640783|-6.1940061|83.3210902 unknown
InChI: InChI=1S/C8H17Br/c1-3-5-6-7-8(9)4-2/h8H,3-7H2,1-2H3
charge 0 multiplicity 1
26 atoms
Br -2.211461 -2.339538 0.230039
C  -0.589703 -0.169952 -0.961778
C  0.50014 -0.118798 0.130327
C  -2.03118 -0.394581 -0.474663
C  1.919546 0.027792 -0.463639
C  -2.547765 0.554243 0.620343
C  3.02371 0.098544 0.615615
C  -2.571599 2.029466 0.145346
C  4.440558 0.242743 0.019264
H  -0.338582 -0.955605 -1.699662
H  -0.589502 0.790429 -1.522867
H  0.30738 0.728177 0.819727
H  0.448072 -1.042825 0.738721
H  -2.725794 -0.417012 -1.333017
H  2.124209 -0.829112 -1.138863
H  1.967347 0.940152 -1.095508
H  -3.569094 0.243874 0.906708
H  -1.920875 0.457206 1.524983
H  2.817241 0.952196 1.293172
H  2.976366 -0.814412 1.243472
H  -3.023892 2.669116 0.92419
H  -1.555605 2.41369 -0.05638
H  -3.171639 2.147097 -0.776388
H  5.211302 0.281114 0.810846
H  4.526656 1.168065 -0.581348
H  4.679664 -0.610171 -0.643742
