program: Gaussian 09
title: 000079130
version: EM64L-G09RevD.01
frameworkgroup: C1[X(C6H4N2O)]
method: RPBEPBE
basis: SDD
operation: Freq
keyword: #pfreq=noraman
keyword: PBEPBE/SDD
title: #p freq=noraman PBEPBE/SDD
converged: YES YES NO YES
title: Mulliken charges:
elementType: O N N C C C C C C H H H H
charge: -0.247989 -0.064644 0.009797 0.352159 -0.320574 -0.320412 -0.285606 -0.285574 0.138107 0.248567 0.248565 0.263792 0.263813
chargesum: 0.00000
title: Mulliken charges with hydrogens summed into heavy atoms:
elementType: O N N C C C C C C
charge: -0.247989 -0.064644 0.009797 0.352159 -0.072007 -0.071847 -0.021814 -0.021761 0.138107
polarizability: 1.76336926e+02 -9.75723027e-03 6.83156623e+01 1.16105805e-03 -2.51960645e-04 3.08962404e+01
1716.lowfreq: -13.0667 -6.6745 0.0003 0.0008 0.0010 9.5004 88.7310 159.3631 222.8755
frequency: 88.7310 159.3613 222.8754 386.6922 400.3226 420.3962 424.0762 482.6574 538.3246 626.9025 702.0598 709.1954 767.8974 779.6551 846.6061 946.6235 965.2820 966.6055 1083.6185 1162.4490 1237.0562 1252.3017 1320.3554 1380.6502 1424.4723 1528.6318 1543.4890 1599.4697 2027.8171 3140.8613 3141.7896 3167.4208 3171.1970
redmass: 9.6018 8.7914 6.6188 3.2642 11.7941 5.0679 6.7519 3.5775 7.6522 7.5032 5.7366 2.9757 1.2440 6.2910 2.0261 3.1019 1.2993 1.2944 1.5248 1.1434 3.4201 1.6714 2.0235 2.1871 4.6839 6.9027 7.3939 6.4381 13.8319 1.0878 1.0878 1.0979 1.0994
irintensity: 5.9568 4.5222 1.5394 0.0000 4.8945 2.0005 7.3761 16.4199 0.4569 1.8711 18.9375 12.0772 0.0000 5.8349 86.7502 0.0062 0.0033 0.0000 25.9036 27.0255 16.7394 5.6253 0.0357 20.7719 9.7359 115.4585 0.3249 225.3341 704.9159 2.7896 0.2729 11.0192 0.0904
temp: 298.150 k
press: 1.00000 atm
elementType: 8 7 7 6 6 6 6 6 6 1 1 1 1
symmnumber: 1
zpe: 230974.0 jmol-1
zpe.correction: 0.087973 hartree
zpe.thermalcorrener: 0.095204 hartree
zpe.thermalcorrenthalpy: 0.096148 hartree
zpe.thermalcorrgfe: 0.056067 hartree
zpe.sumelectzpe: -415.077907 hartree
zpe.sumelectthermal: -415.070676 hartree
zpe.sumelectthermalent: -415.069732 hartree
zpe.sumelectthermalfe: -415.109813 hartree
dipole: 4.5779 0.0015 0.0017
dipole: 4.5779
quadrupole: -69.6192 -42.3863 -53.0484
quadrupole: 0.0004 0.0005 -0.0001
quadrupole: -14.6013 12.6317 1.9696 0.0004 0.0005 -0.0001
hfenergy: -415.1658799 hartree
pointgroup: C01 [X(C6H4N2O1)]
dipole: -1.801102 -0.0002627 0.0006695 debye
dipolederiv: -1.2595014 0.0000005 0.0001994 -0.0000437 -0.4313742 -0.0000005 0.0001792 -0.0000005 -0.3675125 2.5835288 0.0000336 -0.0005825 -0.0025602 -0.1469919 -0.0000005 0.004131 -0.0000011 0.1096012 -1.7918214 -0.0004691 0.0008266 0.0029145 -0.0384077 -0.0000012 -0.0032451 -0.0000004 -0.053997 -1.108576 0.0004435 -0.0001745 -0.0004139 0.0316482 0. -0.0010735 -0.0000005 0.0335891 0.5000078 -0.1323811 -0.0000455 -0.3308712 0.1726116 -0.0000319 -0.0000541 0.0000704 -0.1291178 0.4997386 0.1321946 -0.0000439 0.3312246 0.172587 0.0000363 -0.0000479 -0.0000659 -0.1291825 -0.4260754 -0.0844332 -0.0000089 -0.4165968 -0.0903456 0.000111 0.0002233 -0.0000254 -0.1497061 -0.4260772 0.0845634 -0.0000074 0.4162593 -0.0904567 -0.0001098 0.0002306 0.0000274 -0.1496635 1.2597642 -0.0000124 -0.0002514 0.0000494 0.5118387 0.0000024 -0.0002286 0.0000025 0.1662086 0.0328036 -0.0924405 0.0000309 -0.0296967 -0.0232765 0.0000154 -0.0000092 0.0000359 0.1715531 0.0326896 0.0924626 0.0000322 0.0296405 -0.023236 -0.0000183 -0.0000085 -0.0000387 0.1715605 0.0517466 0.0647707 0.0000131 0.0286642 -0.0223279 -0.0000172 -0.0000479 -0.000003 0.1633211 0.0517722 -0.0647326 0.000012 -0.0285699 -0.022269 0.0000142 -0.0000493 -0.0000006 0.1633458 unknown
polarizability: 176.3369186|-0.0300382|68.3156698|-0.001161|0.0002522|30.8962404 unknown
InChI: InChI=1S/C6H4N2O/c7-8-5-1-3-6(9)4-2-5/h1-4H
charge 0 multiplicity 1
13 atoms
O  3.184699 0.000075 -0.000557
N  -2.31943 -0.000336 0.000901
N  -3.500271 0.001691 -0.000786
C  -0.97754 -0.000212 0.000622
C  -0.258815 -1.26278 0.000317
C  -0.258986 1.262453 0.000335
C  1.118891 -1.253479 -0.000043
C  1.118721 1.253354 -0.000025
C  1.902562 -0.000008 -0.000334
H  -0.826807 -2.199517 0.000445
H  -0.82711 2.199109 0.000477
H  1.686892 -2.189806 -0.000143
H  1.686595 2.189757 -0.000109
