program: Gaussian 09
title: 000000301
version: EM64L-G09RevD.01
frameworkgroup: C1[X(C6H5ClO2)]
method: RPBEPBE
basis: SDD
operation: Freq
keyword: #p
keyword: freq=noraman
keyword: PBEPBE/SDD
title: #p freq=noraman PBEPBE/SDD
converged: NO NO NO YES
title: Mulliken charges:
elementType: Cl O O C C C C C C H H H H H
charge: -0.023654 -0.411501 -0.434658 0.359994 0.306463 -0.219181 -0.376609 -0.312229 -0.335928 0.249626 0.224888 0.256299 0.359847 0.356643
chargesum: 0.00000
title: Mulliken charges with hydrogens summed into heavy atoms:
elementType: Cl O O C C C C C C
charge: -0.023654 -0.051654 -0.078016 0.359994 0.306463 -0.219181 -0.126982 -0.087341 -0.079629
polarizability: 1.10775483e+02 6.28890410e-01 9.41449649e+01 2.32464888e-05 9.06827926e-04 3.16237473e+01
1716.lowfreq: -8.8103 -4.0683 -0.0027 -0.0024 -0.0007 10.8501 133.7466 178.1024 209.1787
frequency: 133.7460 178.1014 209.1768 298.6850 320.5887 325.9072 350.6865 400.7901 432.9741 459.1364 496.3913 571.4659 675.7829 694.4017 746.5815 793.4484 832.1464 877.2268 916.2160 1022.3082 1105.4657 1144.3359 1152.2686 1225.2243 1261.7778 1304.3145 1392.1482 1416.0331 1504.4269 1589.1777 1634.8069 3123.1070 3141.1393 3181.5004 3583.2504 3587.3738
redmass: 5.9090 6.5215 10.8932 6.7328 1.1096 1.1730 5.4097 6.8931 2.9298 9.7128 4.2009 3.5778 7.7482 3.6068 6.5930 1.4611 1.5190 7.2695 1.3407 2.9893 1.5818 1.3283 1.1935 1.7135 2.4552 1.9178 5.4922 3.6838 2.9550 6.8864 7.0634 1.0902 1.0925 1.0949 1.0662 1.0663
irintensity: 0.0053 1.5151 0.2148 18.6778 123.9767 160.1157 2.5209 7.8413 31.5388 2.0005 2.1531 15.7783 5.7400 0.8597 62.3539 34.8965 45.4443 29.2944 0.0804 24.7944 301.0452 11.1944 151.0333 22.8643 22.3705 5.0711 74.3726 59.2674 134.3663 32.5181 5.5027 13.8352 3.0941 3.0521 53.1064 29.5106
temp: 298.150 k
press: 1.00000 atm
elementType: 17 8 8 6 6 6 6 6 6 1 1 1 1 1
symmnumber: 1
zpe: 251706.9 jmol-1
zpe.correction: 0.095870 hartree
zpe.thermalcorrener: 0.104086 hartree
zpe.thermalcorrenthalpy: 0.105031 hartree
zpe.thermalcorrgfe: 0.062896 hartree
zpe.sumelectzpe: -841.473535 hartree
zpe.sumelectthermal: -841.465319 hartree
zpe.sumelectthermalent: -841.464375 hartree
zpe.sumelectthermalfe: -841.506509 hartree
dipole: 1.5700 1.0280 0.0003
dipole: 1.8766
quadrupole: -66.0003 -41.0072 -62.1935
quadrupole: -6.5016 0.0000 0.0005
quadrupole: -9.6000 15.3932 -5.7932 -6.5016 0.0000 0.0005
hfenergy: -841.5694055 hartree
pointgroup: C01 [X(C6H5Cl1O2)]
dipole: -0.5260313 0.5180851 -0.000128 debye
dipolederiv: -0.4347226 0.2894492 -0.0000034 0.3655574 -0.3914472 0.0000049 -0.0000056 0.0000045 -0.04683 -1.197307 -0.524282 0.000025 -0.4529685 -0.206305 -0.0000421 -0.0000191 -0.0000538 -0.3995024 -1.3562652 -0.4017996 -0.0000036 -0.4357749 -0.208807 0.0000292 0.0000325 0.0000367 -0.4319467 0.9035586 0.6545796 -0.000017 0.5980399 -0.0627305 0.0000125 0.0000018 0.0000191 0.057497 1.2208989 0.4236599 -0.0000046 0.473548 0.1336708 -0.0000127 -0.0000222 -0.00002 0.0672584 0.5483151 -0.3255261 0.0000034 -0.7454099 0.6240102 -0.0000117 0.0000237 -0.0000133 -0.0610456 -0.3605248 -0.1305134 0.0000025 0.2427743 -0.0887633 -0.0000012 0.0000003 0.0000067 -0.159763 -0.0182691 -0.3001837 0.0000039 0.1520322 0.0830897 0.0000016 -0.0000066 -0.0000045 -0.1757606 -0.1669078 0.1101888 -0.0000007 -0.333029 0.0245395 -0.0000006 -0.0000073 0.0000001 -0.1649536 0.0627558 -0.0515287 0.0000001 -0.0525857 -0.0353536 0.0000034 -0.0000004 0.0000039 0.1807408 0.0441142 -0.0711116 0.0000019 -0.052141 -0.0934297 0.000001 0.0000018 0.0000011 0.1718478 0.009778 0.0737258 -0.0000001 0.074704 0.0412268 0.0000011 0.0000003 0.000003 0.1784982 0.364674 0.1432695 -0.0000163 0.0817024 0.0965852 0.0000329 0.0000092 0.0000389 0.3909644 0.3799019 0.1100722 0.0000088 0.0835508 0.0837141 -0.0000182 -0.0000084 -0.0000226 0.3929953 unknown
polarizability: 109.8887018|-3.7890298|95.0317457|-0.0001557|-0.0008937|31.6237473 unknown
InChI: InChI=1S/C6H5ClO2/c7-5-3-4(8)1-2-6(5)9/h1-3,8-9H
charge 0 multiplicity 1
14 atoms
Cl 2.117396 -1.920282 0.000069
O  2.450845 1.051741 0.000036
O  -2.960975 -0.557095 0.00007
C  1.09763 0.682043 0.000027
C  -1.602262 -0.192884 0.000046
C  0.781623 -0.69699 0.000048
C  -0.553261 -1.143063 0.000063
C  0.031936 1.616172 0.00003
C  -1.310159 1.189345 0.000035
H  -0.759797 -2.219568 0.000083
H  0.256597 2.690393 0.000029
H  -2.133339 1.908305 0.000034
H  2.541591 2.037055 -0.000078
H  -3.067024 -1.540473 0.00001
