program: Gaussian 09
title: 000079092
version: EM64L-G09RevD.01
frameworkgroup: C1[X(C2H2Br2Cl2)]
method: RPBEPBE
basis: SDD
operation: Freq
keyword: #p
keyword: freq=noraman
keyword: PBEPBE/SDD
title: #p freq=noraman PBEPBE/SDD
converged: NO NO NO NO
title: Mulliken charges:
elementType: Br Br Cl Cl C C H H
charge: 0.098803 0.098803 0.085033 0.085034 -0.548564 -0.548565 0.364728 0.364728
chargesum: 0.00000
title: Mulliken charges with hydrogens summed into heavy atoms:
elementType: Br Br Cl Cl C C
charge: 0.098803 0.098803 0.085033 0.085034 -0.183836 -0.183837
polarizability: 1.02797789e+02 1.61130539e+01 5.64783550e+01 3.20146489e-04 -6.75042933e-05 5.35828141e+01
1716.lowfreq: -12.7691 -4.9444 -0.0007 0.0010 0.0026 3.5927 60.7981 126.5001 147.6807
frequency: 60.7963 126.4991 147.6807 167.1782 212.3919 229.1765 496.7496 568.6444 586.5273 663.1066 726.3729 1028.5395 1151.5201 1177.2280 1199.8462 1265.3628 3117.8890 3124.4785
redmass: 26.9952 19.3853 39.6910 31.3304 19.7470 31.9981 9.1625 8.9759 8.4800 6.0126 5.5713 4.0620 1.0455 1.0931 1.2338 1.1804 1.0864 1.0888
irintensity: 0.2269 1.0216 0.0627 0.0049 1.2610 0.3431 25.4001 139.6799 24.8306 57.5729 82.0386 11.4852 20.6643 6.6761 0.0065 10.0301 2.8457 0.0004
temp: 298.150 k
press: 1.00000 atm
elementType: 35 35 17 17 6 6 1 1
symmnumber: 1
zpe: 96000.2 jmol-1
zpe.correction: 0.036565 hartree
zpe.thermalcorrener: 0.044118 hartree
zpe.thermalcorrenthalpy: 0.045063 hartree
zpe.thermalcorrgfe: 0.000949 hartree
zpe.sumelectzpe: -1023.957613 hartree
zpe.sumelectthermal: -1023.950059 hartree
zpe.sumelectthermalent: -1023.949115 hartree
zpe.sumelectthermalfe: -1023.993228 hartree
dipole: 0.0000 0.0000 -2.1337
dipole: 2.1337
quadrupole: -69.6252 -67.9459 -66.9078
quadrupole: 1.3734 0.0000 0.0000
quadrupole: -1.4656 0.2137 1.2518 1.3734 0.0000 0.0000
hfenergy: -1023.9941775 hartree
pointgroup: C01 [X(C2H2Br2Cl2)]
dipole: -0.0000148 -0.0000191 -0.8394464 debye
dipolederiv: -0.6061702 -0.2570002 -0.1399965 -0.2271157 -0.2442509 -0.1318076 -0.0800001 -0.0876634 -0.0901979 -0.6061687 -0.2569921 0.1400184 -0.2270489 -0.2442181 0.1318093 0.0799994 0.087668 -0.0902202 -0.1547515 0.0058902 -0.0088867 -0.0165439 -0.3460333 -0.2682975 -0.0272682 -0.3369372 -0.3633011 -0.1547534 0.0059009 0.0088787 -0.0164904 -0.3459893 0.2682964 0.0272035 0.3369128 -0.3633295 0.8025374 0.3005159 0.2003606 0.2590354 0.6002941 0.5438556 0.0459028 0.5818668 0.456968 0.802512 0.3004822 -0.2003736 0.2589758 0.6002265 -0.5438518 -0.0458118 -0.58184 0.4570433 -0.0415814 -0.0493909 -0.0005843 -0.0153924 -0.0100109 -0.009579 0.008859 -0.0357656 -0.0034774 -0.0416242 -0.0494059 0.0005835 -0.0154199 -0.0100182 0.0095747 -0.0088845 0.0357585 -0.0034852 unknown
polarizability: 93.9236544|24.3295118|65.35249|0.0003272|0.0000027|53.5828141 unknown
InChI: InChI=1S/C2H2Br2Cl2/c3-1(5)2(4)6/h1-2H
charge 0 multiplicity 1
8 atoms
Br -2.279143 -0.661971 -0.663792
Br 2.279106 0.661905 -0.663904
Cl -0.73475 1.530326 1.071141
Cl 0.734773 -1.530314 1.071182
C  -0.612043 0.459006 -0.428519
C  0.612014 -0.45906 -0.42852
H  -0.59674 1.125778 -1.301858
H  0.596682 -1.125871 -1.301829
