program: Gaussian 09
title: 000079077
version: EM64L-G09RevD.01
frameworkgroup: C1[X(C4H8Cl2O)]
method: RPBEPBE
basis: SDD
operation: Freq
keyword: #p
keyword: freq=noraman
keyword: PBEPBE/SDD
title: #p freq=noraman PBEPBE/SDD
converged: NO YES NO NO
title: Mulliken charges:
elementType: Cl Cl O C C C C H H H H H H H H
charge: -0.130223 -0.054502 -0.184948 -0.149136 -0.211708 -0.572806 -0.671485 0.271035 0.235942 0.206164 0.283714 0.293282 0.212155 0.234917 0.237599
chargesum: 0.00000
title: Mulliken charges with hydrogens summed into heavy atoms:
elementType: Cl Cl O C C C C
charge: -0.130223 -0.054502 -0.184948 0.121899 0.230398 0.004191 0.013185
polarizability: 7.27452774e+01 7.16096131e+00 8.44896125e+01 -9.42563113e-01 -3.74692598e+00 4.60838680e+01
1716.lowfreq: -0.0015 0.0009 0.0018 3.8505 8.3985 13.5396 48.2127 86.1215 103.0432
frequency: 48.0102 86.1137 103.0397 165.7977 182.6887 233.8804 257.5448 308.6449 437.0469 463.9661 598.1097 665.1444 785.0335 812.5513 918.4792 1013.5957 1042.6891 1114.2249 1120.1086 1135.1375 1172.2968 1221.0471 1254.7678 1264.2868 1333.7041 1392.9095 1407.6250 1434.0119 1461.9979 1475.5196 1486.9339 2975.6738 3001.4473 3046.0390 3055.4706 3093.1635 3099.2295 3111.2735 3187.4401
redmass: 2.6558 3.1610 3.6847 6.8239 2.2973 1.4657 5.4020 5.3365 3.2451 3.2309 7.9736 6.1387 2.2545 1.1142 1.9824 2.1132 2.7253 1.9415 1.3875 1.4445 1.9469 1.5126 1.1514 1.1578 1.2478 1.3137 1.3983 1.1167 1.0394 1.0683 1.0659 1.0580 1.0365 1.1052 1.0889 1.0570 1.0988 1.1019 1.1118
irintensity: 0.0157 2.7104 4.9459 11.3230 4.4716 0.1320 9.1695 10.1425 5.4292 5.0875 166.7820 18.7020 4.9727 4.9325 11.8924 31.1357 137.3429 5.3954 91.6822 21.4142 35.8848 49.2098 3.8464 4.2931 34.3769 26.1365 7.2261 16.7153 12.7635 3.6623 11.3869 36.9898 16.2444 18.3203 18.3873 3.5897 25.8748 30.5070 2.5391
temp: 298.150 k
press: 1.00000 atm
elementType: 17 17 8 6 6 6 6 1 1 1 1 1 1 1 1
symmnumber: 1
zpe: 304848.2 jmol-1
zpe.correction: 0.116111 hartree
zpe.thermalcorrener: 0.125138 hartree
zpe.thermalcorrenthalpy: 0.126083 hartree
zpe.thermalcorrgfe: 0.080483 hartree
zpe.sumelectzpe: -1151.978948 hartree
zpe.sumelectthermal: -1151.969920 hartree
zpe.sumelectthermalent: -1151.968976 hartree
zpe.sumelectthermalfe: -1152.014576 hartree
dipole: 1.7446 -0.8595 1.0677
dipole: 2.2186
quadrupole: -53.9258 -62.0424 -54.9466
quadrupole: -7.1137 2.2233 -0.8480
quadrupole: 3.0458 -5.0708 2.0250 -7.1137 2.2233 -0.8480
hfenergy: -1152.0950588 hartree
pointgroup: C01 [X(C4H8Cl2O1)]
dipole: 0.7673154 -0.1090298 0.4015744 debye
dipolederiv: -0.3646479 -0.1172616 0.0050869 0.1716956 -0.9805331 0.0842349 -0.0547975 0.100384 -0.2473215 -0.2915069 -0.1723776 0.0109372 -0.2252736 -0.5438277 0.0693924 0.0352931 0.0980241 -0.1942698 -1.367636 0.5036779 -0.0419755 0.353761 -0.7157193 0.0347841 0.1179379 -0.1488163 -0.3576947 0.9545058 -0.2441563 -0.0664436 -0.5589008 1.4091271 -0.1240588 -0.2293383 0.0842253 0.378027 0.8848516 -0.2029469 0.0783232 -0.017571 0.3006278 -0.0573612 0.1889204 -0.1334762 0.3725017 0.1396563 0.259344 -0.07328 0.2566467 0.6031844 -0.1336135 -0.0856015 -0.0917569 0.1693856 -0.0860593 0.0779345 0.0329137 0.0809912 0.0048045 -0.0311251 0.030613 -0.0296885 0.0223338 0.0136699 -0.0390787 -0.0369253 0.0587404 -0.0569537 0.0505579 0.0262981 -0.000069 -0.1156251 -0.0238339 0.0349203 -0.0127804 -0.0843544 -0.1036387 -0.0102843 -0.0379841 0.04706 0.0652761 -0.0506683 0.0181177 0.0794089 -0.0041307 0.0615343 0.0354005 -0.0326399 0.0362129 -0.1820079 0.001172 -0.0007455 0.0398163 0.0410568 -0.0472644 0.0144411 0.0485189 0.0093051 0.0913479 0.1061169 -0.0344223 0.045316 -0.0438292 0.0115229 0.0306138 0.0002308 0.0062034 -0.0357096 -0.1217594 0.0020476 -0.0829907 -0.0174917 0.0944068 -0.0298519 -0.0977792 -0.0231218 0.0602427 0.0900946 -0.0879278 0.0187195 -0.0274353 -0.1114018 0.0122953 0.0398285 0.0200685 0.0927573 0.1160445 0.0028748 0.0038739 0.0160949 0.0741308 0.0545748 0.0505 0.0254453 -0.1192434 unknown
polarizability: 69.8582877|2.8604881|86.443295|-1.0288952|-7.2383347|47.0171752 unknown
InChI: InChI=1S/C4H8Cl2O/c1-2-7-4(6)3-5/h4H,2-3H2,1H3
charge 0 multiplicity 1
15 atoms
Cl -0.44762 2.444315 -0.172136
Cl -2.355977 -1.639407 0.358809
O  0.490426 -0.203192 -0.265456
C  -0.570815 0.500693 0.288412
C  1.811049 0.000191 0.398255
C  -1.89014 0.067514 -0.316366
C  2.801735 -0.943214 -0.273385
H  -0.565891 0.557947 1.390959
H  2.091525 1.062581 0.268449
H  1.697729 -0.218244 1.479623
H  -2.706069 0.738709 -0.023467
H  -1.815123 -0.036818 -1.407059
H  3.801355 -0.823778 0.181744
H  2.486909 -1.993817 -0.156386
H  2.880906 -0.71998 -1.350595
