program: Gaussian 09
title: 000079069
version: EM64L-G09RevD.01
frameworkgroup: C1[X(C7H16O)]
method: RPBEPBE
basis: SDD
operation: Freq
keyword: #pfreq=noraman
keyword: PBEPBE/SDD
title: #p freq=noraman PBEPBE/SDD
converged: YES YES NO NO
title: Mulliken charges:
elementType: O C C C C C C C H H H H H H H H H H H H H H H H
charge: -0.462447 0.024442 -0.077805 -0.430187 -0.408894 -0.733530 -0.711915 -0.729567 0.199398 0.187117 0.201107 0.207670 0.245467 0.199175 0.224986 0.229503 0.199729 0.212279 0.212974 0.224212 0.215558 0.214244 0.223111 0.333374
chargesum: 0.00000
title: Mulliken charges with hydrogens summed into heavy atoms:
elementType: O C C C C C C C
charge: -0.129073 0.223840 0.109312 -0.021410 0.035748 -0.079313 -0.062451 -0.076654
polarizability: 8.86148875e+01 -7.51314656e-02 8.12334844e+01 -1.08561874e+00 -9.22913696e-01 6.94624316e+01
1716.lowfreq: -0.0008 -0.0005 -0.0003 10.1507 11.7378 27.4863 53.7733 98.2634 107.4449
frequency: 53.5417 98.1187 107.2927 189.9583 207.9103 222.9939 238.7673 277.1744 286.8243 321.1914 344.8725 398.4361 441.0340 462.6484 553.8489 735.0710 779.8541 824.5227 842.3610 911.8516 920.7989 999.5385 1010.5802 1026.5687 1038.6431 1065.6074 1074.9852 1134.4770 1139.9413 1161.1216 1221.5483 1253.8750 1274.9149 1289.6328 1308.2326 1322.2555 1338.8388 1355.0920 1380.4701 1386.6808 1387.6236 1391.9421 1462.4489 1468.1432 1472.4604 1476.7927 1477.3772 1486.4445 1487.8316 1495.6947 2931.3609 2958.7166 2970.3873 2973.1575 2976.9426 2978.6749 2996.4327 3024.3033 3050.8989 3058.8751 3068.0440 3070.0583 3077.3440 3080.6984 3085.7162 3559.4614
redmass: 3.3069 1.9363 2.1191 2.1430 1.5457 1.1018 1.2420 1.9367 1.0987 1.9029 2.5945 3.1952 2.8255 2.5848 2.3463 1.4955 1.3707 1.4468 2.4920 1.8303 1.8584 1.4440 1.4571 1.8600 1.8027 1.7243 2.6853 2.1102 1.8885 1.9384 1.4080 1.3186 1.1507 1.2381 1.2320 1.3337 1.4430 1.4396 1.5588 1.2344 1.2242 1.2094 1.0646 1.0627 1.0627 1.0524 1.0553 1.0438 1.0521 1.0648 1.0816 1.0805 1.0422 1.0546 1.0380 1.0376 1.0667 1.0983 1.0965 1.0968 1.0993 1.0976 1.0999 1.0997 1.0997 1.0661
irintensity: 1.6915 0.1481 0.2995 1.0262 1.3117 0.0968 0.6069 4.0103 140.5050 0.4012 6.3045 2.6354 1.8376 7.1941 2.5953 12.1610 7.2068 2.5467 21.5733 29.6495 9.3072 2.1090 5.8039 13.4611 13.0345 30.9614 27.7594 2.1160 2.3898 2.7386 19.9139 6.7216 6.3635 5.0042 3.2182 3.8709 2.8425 0.5471 11.6237 12.9674 17.7385 13.8607 0.6854 17.0782 20.0790 3.6264 22.2475 3.2813 4.7663 6.2900 29.3031 33.3028 14.8867 50.4359 24.5774 46.7627 46.7842 36.7523 0.5594 37.7025 40.6521 65.9698 73.5069 50.1673 33.3630 2.7234
temp: 298.150 k
press: 1.00000 atm
elementType: 8 6 6 6 6 6 6 6 1 1 1 1 1 1 1 1 1 1 1 1 1 1 1 1
symmnumber: 1
zpe: 571036.9 jmol-1
zpe.correction: 0.217496 hartree
zpe.thermalcorrener: 0.228286 hartree
zpe.thermalcorrenthalpy: 0.229230 hartree
zpe.thermalcorrgfe: 0.182004 hartree
zpe.sumelectzpe: -350.864020 hartree
zpe.sumelectthermal: -350.853231 hartree
zpe.sumelectthermalent: -350.852286 hartree
zpe.sumelectthermalfe: -350.899512 hartree
dipole: -0.7076 -1.0722 1.2463
dipole: 1.7898
quadrupole: -47.8340 -53.6796 -53.6715
quadrupole: 0.5081 -2.8908 1.0874
quadrupole: 3.8943 -1.9513 -1.9431 0.5081 -2.8908 1.0874
hfenergy: -351.0815165 hartree
pointgroup: C01 [X(C7H16O1)]
dipole: 0.2564024 0.4383471 0.4878004 debye
dipolederiv: -0.5112394 0.1880824 0.2522863 0.1629655 -0.7081846 -0.0173023 0.2731874 -0.0133478 -0.4263874 0.0177718 0.0296869 -0.0076838 -0.0344693 0.0538717 -0.0299372 -0.0402449 -0.0110373 0.0845139 0.521381 -0.1084161 -0.1509708 -0.102409 0.4738985 0.0539335 -0.1303711 0.0176366 0.3901815 0.0245345 0.0076997 -0.0188617 0.0052429 0.0817933 -0.0554874 -0.050528 -0.0437179 0.1175912 0.0539555 -0.0157305 0.0199463 0.0300562 0.0645507 -0.0297209 0.0184791 -0.0574796 0.0795631 -0.0413227 -0.1353143 -0.0030396 -0.0423428 -0.1582692 -0.044903 0.0163852 -0.0475301 0.043588 -0.065006 0.0218847 -0.0404723 0.0230084 0.0791629 -0.0022722 -0.0164861 -0.009827 0.0713325 0.0761236 -0.046987 0.0189781 -0.0527392 -0.0089676 0.064321 0.0203759 0.0676622 -0.0344927 0.0310607 -0.0236204 0.0367134 -0.0231227 -0.0258607 0.0951855 0.0328399 0.0826421 -0.1454093 -0.0079588 0.0178492 0.0506527 0.0135936 -0.0448709 0.0793309 0.0603703 0.0577406 -0.208572 0.0279127 0.0261004 -0.015093 0.0097078 0.0653874 0.0868396 0.0030138 0.0514589 -0.1741779 0.012678 -0.0905687 -0.0101716 -0.0980375 -0.1790427 -0.027103 -0.0046868 -0.0100641 0.0606918 0.0516137 0.100047 0.0970153 0.0810185 -0.0208769 -0.0425332 0.0828251 -0.0266819 0.0018551 -0.126686 -0.0467535 -0.1432011 -0.0313054 0.0484588 0.0430486 -0.1206032 0.0471671 -0.0436707 0.0608847 0.1035874 0.0943156 0.076926 -0.0293094 -0.0827529 0.0855848 -0.0873695 0.0084641 0.0939664 -0.0049831 -0.0209596 -0.0224495 0.0356745 0.0532665 0.0264064 0.1157212 -0.1047354 -0.1981118 -0.0239168 -0.0943405 0.0446057 0.0537908 0.0170469 -0.0926871 0.0081025 0.0611594 -0.0512316 0.1136769 0.0484519 0.148215 -0.0519007 -0.0733442 0.078804 -0.0970746 0.0389251 0.0665786 -0.0163968 0.0370548 -0.004317 0.0762871 0.0471833 -0.0322076 0.0704603 -0.163402 0.025154 -0.1018444 -0.0067225 -0.1445534 -0.1043544 0.0137066 -0.0083779 0.0218164 0.0720441 -0.0539808 0.0809345 0.1002967 0.1140197 0.036842 -0.0817334 0.0976059 -0.0555001 -0.0099975 0.0511855 -0.1032336 -0.001504 -0.1016218 -0.1817581 -0.0077525 -0.0135417 -0.0424847 0.0798611 -0.0799239 0.0390752 -0.1346853 0.0112299 0.1012889 -0.0029534 -0.111951 0.023099 -0.0300633 0.0206602 -0.0108591 -0.1080052 -0.0632216 0.3423885 -0.0560666 -0.1741924 -0.0613923 0.2311375 unknown
polarizability: 88.6100752|0.3571334|81.2540692|0.9221517|0.952675|69.4466591 unknown
InChI: InChI=1S/C7H16O/c1-4-7(5-2)6(3)8/h6-8H,4-5H2,1-3H3
charge 0 multiplicity 1
24 atoms
O  2.119589 -0.785009 -0.5364
C  -0.109313 0.142641 -0.389794
C  1.290754 0.141136 0.27588
C  -1.086904 1.094024 0.356929
C  -0.663376 -1.304436 -0.543774
C  1.965035 1.525047 0.336167
C  -2.499721 1.15458 -0.264863
C  -1.004156 -2.026103 0.780411
H  0.037838 0.543244 -1.416889
H  1.203084 -0.262639 1.310219
H  -1.166648 0.788252 1.420497
H  -0.666407 2.118208 0.36019
H  0.09049 -1.89534 -1.093334
H  -1.568754 -1.27015 -1.180828
H  1.417838 2.219212 0.998153
H  2.021335 1.970538 -0.674004
H  2.995934 1.4424 0.733917
H  -3.11928 1.917872 0.241389
H  -2.448994 1.418638 -1.338352
H  -3.027601 0.187868 -0.181903
H  -1.78734 -1.496439 1.35465
H  -1.375568 -3.047532 0.577264
H  -0.114417 -2.124139 1.428801
H  3.047481 -0.765173 -0.190127
