program: Gaussian 09
title: 000000289
version: EM64L-G09RevD.01
frameworkgroup: C1[X(C6H6O2)]
method: RPBEPBE
basis: SDD
operation: Freq
keyword: #p
keyword: freq=noraman
keyword: PBEPBE/SDD
title: #p freq=noraman PBEPBE/SDD
converged: NO NO NO NO
title: Mulliken charges:
elementType: O O C C C C C C H H H H H H
charge: -0.437866 -0.491884 0.173319 0.167624 -0.314012 -0.337039 -0.215896 -0.223916 0.251367 0.219561 0.228470 0.226596 0.382197 0.371479
chargesum: 0.00000
title: Mulliken charges with hydrogens summed into heavy atoms:
elementType: O O C C C C C C
charge: -0.055670 -0.120405 0.173319 0.167624 -0.062645 -0.117478 0.012574 0.002681
polarizability: 9.17005578e+01 7.64097373e-01 8.14584544e+01 -3.82284719e-04 -1.86969928e-04 2.91226037e+01
1716.lowfreq: -11.3504 -5.4770 -0.0011 -0.0009 -0.0003 3.5348 184.7168 265.0793 279.8032
frequency: 184.7152 265.0784 279.8026 284.9107 422.8563 435.9048 484.2855 536.9924 552.7351 566.4686 707.5759 740.4854 746.9182 828.3335 829.1412 906.1326 957.9546 1022.1427 1065.5298 1124.8631 1165.1475 1175.3893 1214.4250 1265.6913 1333.8032 1411.3745 1456.7674 1500.9047 1614.5038 1621.5366 3116.5733 3141.3230 3160.9653 3175.9769 3526.6346 3621.9518
redmass: 5.4746 1.3718 5.0951 2.5645 4.7069 2.9602 1.1226 6.0451 3.7970 7.3578 4.2623 1.2304 5.7098 6.3006 1.3915 1.3648 1.2917 2.0887 2.2509 1.2592 1.0609 1.3180 2.8812 2.2018 1.4195 5.5256 2.4849 3.0679 7.0203 6.4525 1.0890 1.0877 1.0941 1.0995 1.0648 1.0666
irintensity: 0.3165 138.0333 6.6394 48.9792 10.9655 20.5067 130.2589 11.0395 1.3567 2.7611 0.1590 114.6684 23.4271 23.7324 0.4010 4.3193 0.1214 15.3229 131.3584 45.1561 1.0137 117.5316 121.3557 83.1909 41.6063 10.3322 34.6072 79.7786 26.6477 9.1230 12.3540 7.7262 18.9641 9.5379 71.7577 47.4541
temp: 298.150 k
press: 1.00000 atm
elementType: 8 8 6 6 6 6 6 6 1 1 1 1 1 1
symmnumber: 1
zpe: 277807.5 jmol-1
zpe.correction: 0.105811 hartree
zpe.thermalcorrener: 0.112670 hartree
zpe.thermalcorrenthalpy: 0.113614 hartree
zpe.thermalcorrgfe: 0.075218 hartree
zpe.sumelectzpe: -382.092328 hartree
zpe.sumelectthermal: -382.085470 hartree
zpe.sumelectthermalent: -382.084526 hartree
zpe.sumelectthermalfe: -382.122922 hartree
dipole: -0.1549 2.9839 0.0001
dipole: 2.9879
quadrupole: -41.3350 -39.6828 -50.7217
quadrupole: 5.0646 0.0001 0.0000
quadrupole: 2.5782 4.2304 -6.8085 5.0646 0.0001 0.0000
hfenergy: -382.1981395 hartree
pointgroup: C01 [X(C6H6O2)]
dipole: -0.1017317 -1.1711397 -0.0000323 debye
dipolederiv: -1.173819 -0.476067 -0.000008 -0.4875897 -0.3534432 0.0000032 -0.0000184 -0.0000028 -0.4191853 -1.0627568 0.5622844 -0.0000013 0.5495357 -0.4600501 0.0000102 0. 0.0000081 -0.4408747 0.983083 0.461081 0.0000118 0.7093685 0.1586937 0.0000022 0.0000206 0.0000027 0.0641378 0.7222971 -0.5140769 -0.0000023 -0.8136783 0.2885668 -0.0000064 -0.0000106 0.0000068 0.0131745 -0.1365802 -0.1597583 -0.0000006 0.0768504 0.0856481 -0.000002 -0.0000018 -0.000001 -0.1711836 -0.081659 0.1048532 0.0000052 -0.0281404 0.0309548 -0.0000012 0.000004 -0.0000029 -0.1723548 0.0346571 0.0542063 0.000001 -0.1131116 0.0466277 -0.0000023 0.0000059 -0.0000016 -0.1788645 -0.0346983 -0.0191718 0.0000002 0.101961 -0.0392489 -0.0000003 -0.0000045 -0.000004 -0.1887947 0.0970658 -0.0184944 0.0000002 -0.0105921 -0.0648111 0.0000022 -0.0000012 0. 0.1734907 0.0756041 0.041393 -0.0000015 0.0219894 -0.1278167 0.0000018 0. 0.0000007 0.1746958 -0.0665071 0.0910614 -0.0000019 0.0947752 0.0325396 0.0000015 -0.0000036 0.0000026 0.1683153 -0.0724853 -0.0831029 -0.0000007 -0.0903479 0.0338034 0.0000002 0.0000014 0.0000017 0.1722761 0.3873798 0.1156922 0.0000007 0.0928564 0.2125764 -0.0000033 0.0000061 -0.000001 0.3955501 0.3284188 -0.1599001 -0.0000028 -0.1038766 0.1559595 -0.0000061 0.0000021 -0.0000092 0.4096173 unknown
polarizability: 91.6350249|-1.1183671|81.5239873|0.0003755|-0.0002002|29.1226037 unknown
InChI: InChI=1S/C6H6O2/c7-5-3-1-2-4-6(5)8/h1-4,7-8H
charge 0 multiplicity 1
14 atoms
O  1.821966 1.368931 0.00012
O  1.854218 -1.327576 0.000115
C  0.598734 0.688768 0.000102
C  0.570235 -0.731454 0.000118
C  -0.610014 1.410963 0.000085
C  -0.652173 -1.428569 0.000111
C  -1.841478 0.715156 0.000091
C  -1.865976 -0.69915 0.000093
H  -0.565985 2.504206 0.000075
H  -0.66182 -2.526399 0.000117
H  -2.779298 1.280301 0.000083
H  -2.819932 -1.23602 0.00009
H  2.557658 0.701122 0.000109
H  1.803666 -2.312979 0.000091
