program: Gaussian 09
title: 000000286
version: EM64L-G09RevD.01
frameworkgroup: C1[X(C2H5NO3)]
method: RPBEPBE
basis: SDD
operation: Freq
keyword: #pfreq=noraman
keyword: PBEPBE/SDD
title: #p freq=noraman PBEPBE/SDD
converged: YES YES NO NO
title: Mulliken charges:
elementType: O O O N C C H H H H H
charge: -0.265817 -0.425018 -0.206070 -0.476609 -0.278576 0.180658 0.242049 0.242248 0.302261 0.302144 0.382732
chargesum: 0.00000
title: Mulliken charges with hydrogens summed into heavy atoms:
elementType: O O O N C C
charge: -0.265817 -0.042286 -0.206070 0.127796 0.205720 0.180658
polarizability: 5.51188261e+01 1.18797925e-01 3.90256179e+01 3.13897571e-02 5.09758523e-02 2.74460794e+01
1716.lowfreq: -3.9560 -1.5683 -0.0001 0.0005 0.0008 9.9521 35.0139 65.3338 177.0912
frequency: 35.0048 65.3244 177.0912 201.6425 360.8961 419.2567 498.1732 582.1791 626.4694 798.6205 876.5768 950.5248 999.2256 1051.3643 1149.9758 1167.5641 1217.1023 1252.6440 1362.2594 1449.8385 1608.5603 1693.4742 2984.0657 3035.0057 3322.9324 3461.2327 3519.0802
redmass: 3.8040 2.8047 6.1220 1.1373 7.3536 5.6021 1.8015 4.7473 1.4430 4.7468 4.1943 3.4816 1.9410 2.2491 2.0699 1.0729 1.1244 1.6003 1.7209 1.0690 1.0703 8.9086 1.0566 1.1038 1.0416 1.0990 1.0642
irintensity: 0.2883 0.1144 5.1917 85.8610 5.5888 13.5119 24.3572 35.2131 153.5417 14.2263 1.5564 195.4512 0.1124 189.0817 54.6537 0.1875 0.3978 11.0864 17.2890 29.4059 22.4020 223.8176 30.4033 21.2613 2.6373 0.2076 25.7751
temp: 298.150 k
press: 1.00000 atm
elementType: 8 8 8 7 6 6 1 1 1 1 1
symmnumber: 1
zpe: 208545.5 jmol-1
zpe.correction: 0.079431 hartree
zpe.thermalcorrener: 0.086609 hartree
zpe.thermalcorrenthalpy: 0.087553 hartree
zpe.thermalcorrgfe: 0.047160 hartree
zpe.sumelectzpe: -359.075219 hartree
zpe.sumelectthermal: -359.068041 hartree
zpe.sumelectthermalent: -359.067097 hartree
zpe.sumelectthermalfe: -359.107490 hartree
dipole: 0.9117 -1.4693 0.0039
dipole: 1.7292
quadrupole: -21.4261 -42.8758 -32.5562
quadrupole: 3.7952 -0.0440 0.0479
quadrupole: 10.8599 -10.5898 -0.2702 3.7952 -0.0440 0.0479
hfenergy: -359.1546501 hartree
pointgroup: C01 [X(C2H5N1O3)]
dipole: 0.3768504 0.5663849 -0.0036469 debye
dipolederiv: -0.4866571 0.1197463 -0.0022024 0.0087991 -0.2796437 -0.0008014 0.0000326 -0.0008195 -0.3482427 -0.8919521 0.5568898 0.0010075 0.485455 -0.7432697 -0.0008077 0.0010715 -0.0001381 -0.4409413 -0.6032307 -0.2056929 0.0016308 0.0872422 -0.9727814 0.0018817 0.0012763 0.0015169 -0.3031384 -0.0552724 -0.0637811 0.0013599 0.0414372 -0.2944604 0.0048854 -0.000983 0.0044261 -0.0498408 0.2977902 -0.2259013 0.0048252 -0.5328925 0.1580266 0.0029077 0.0119487 0.0036192 0.3951719 1.3461758 -0.1749802 -0.0050023 -0.2666904 1.4867782 -0.0024844 -0.0063465 -0.0029871 0.2102489 0.0247097 0.0199453 -0.0091274 0.0915673 0.006866 -0.0819709 0.015613 -0.1123748 -0.0402286 0.0242998 0.0193467 0.0084524 0.0906451 0.0136678 0.079727 -0.0199541 0.1102449 -0.0466076 0.0723095 0.0311349 0.0557591 0.0704808 0.1983766 -0.1524741 0.0269215 -0.101917 0.1156183 0.0719069 0.0291638 -0.0570871 0.0694828 0.2080218 0.1486789 -0.0297454 0.098314 0.1056234 0.1999204 -0.1058712 0.0003842 -0.1455264 0.2184182 0.0004578 0.0001655 0.0001153 0.402337 unknown
polarizability: 55.0950433|-0.6294707|39.049613|-0.0327353|0.0102688|27.4458672 unknown
InChI: InChI=1S/C2H5NO3/c3-6-1-2(4)5/h4H,1,3H2
charge 0 multiplicity 1
11 atoms
O  1.322815 -0.487444 0.011475
O  -2.023603 0.952903 0.001815
O  -1.337513 -1.274519 0.003951
N  2.665951 0.183481 -0.002299
C  0.324026 0.582309 -0.0069
C  -1.050156 -0.064627 0.001435
H  0.424287 1.244846 0.874991
H  0.426454 1.214959 -0.910474
H  3.129619 -0.213986 -0.839095
H  3.131153 -0.180829 0.848651
H  -2.928733 0.538406 0.003149
