program: Gaussian 09
title: 000078980
version: EM64L-G09RevD.01
frameworkgroup: C1[X(C2HClF3I)]
method: RPBEPBE
basis: SDD
operation: Freq
keyword: #p
keyword: freq=noraman
keyword: PBEPBE/SDD
title: #p freq=noraman PBEPBE/SDD
converged: NO NO NO NO
title: Mulliken charges:
elementType: I Cl F F F C C H
charge: 0.167616 0.067412 -0.107583 -0.125917 -0.151263 0.132294 -0.294789 0.312230
chargesum: 0.00000
title: Mulliken charges with hydrogens summed into heavy atoms:
elementType: I Cl F F F C C
charge: 0.167616 0.067412 -0.107583 -0.125917 -0.151263 0.132294 0.017441
polarizability: 6.44804740e+01 -1.03596002e+01 5.17900015e+01 8.34924178e+00 -5.12895737e-01 3.18573210e+01
1716.lowfreq: 0.0013 0.0017 0.0019 5.1903 10.4063 16.4352 59.8532 113.9798 191.3368
frequency: 59.8163 113.9727 191.3362 237.1168 264.2514 322.6196 354.3512 391.8867 510.3921 650.8610 742.5196 884.6350 957.6753 985.8991 1135.2704 1198.2909 1289.9568 3117.6914
redmass: 17.7809 31.2036 15.6867 21.3807 19.2350 14.4646 16.4459 22.9464 13.5202 5.2214 9.1910 7.9956 10.5484 6.3495 9.3829 1.2385 1.2128 1.0873
irintensity: 0.1137 0.5104 1.5811 0.8997 1.4114 2.5670 3.8651 2.2992 22.6255 49.2304 87.6788 237.3172 55.9631 216.1679 131.7756 12.6935 9.6607 1.2007
temp: 298.150 k
press: 1.00000 atm
elementType: 53 17 9 9 9 6 6 1
symmnumber: 1
zpe: 80200.9 jmol-1
zpe.correction: 0.030547 hartree
zpe.thermalcorrener: 0.038152 hartree
zpe.thermalcorrenthalpy: 0.039096 hartree
zpe.thermalcorrgfe: -0.004258 hartree
zpe.sumelectzpe: -847.327520 hartree
zpe.sumelectthermal: -847.319916 hartree
zpe.sumelectthermalent: -847.318972 hartree
zpe.sumelectthermalfe: -847.362325 hartree
dipole: 1.0551 -1.2602 -1.6083
dipole: 2.2995
quadrupole: -61.3749 -63.4167 -59.0826
quadrupole: -0.1525 1.9252 -0.7095
quadrupole: -0.0835 -2.1253 2.2088 -0.1525 1.9252 -0.7095
hfenergy: -847.3580673 hartree
pointgroup: C01 [X(C2H1Cl1F3I1)]
dipole: 0.3210912 -0.5463655 -0.6456594 debye
dipolederiv: -0.1675103 0.1977609 -0.0483474 0.1752093 -0.1875799 0.0591651 -0.0658512 0.0881198 0.0078112 -0.2877721 -0.2040064 -0.0882448 -0.2175844 -0.5072715 -0.1888675 -0.0491401 -0.1606792 -0.1953174 -0.3512538 -0.0136002 0.016484 -0.0256817 -0.2831233 -0.0483238 -0.0258467 -0.14398 -0.8513898 -0.6472708 0.3689155 -0.1210709 0.2018137 -0.698214 0.0951416 0.0194086 0.0877575 -0.2989231 -0.3425323 -0.1735878 -0.0086657 0.0533943 -0.9389244 -0.0007097 0.0495437 -0.1240395 -0.202974 1.259545 -0.2319378 0.1602494 0.3266349 1.4299523 0.1802901 -0.0251859 0.3521917 1.337132 0.5602035 0.0141728 0.1683477 -0.5569959 1.1866468 -0.1473678 0.119287 -0.0935148 0.205661 -0.0234091 0.0422829 -0.0787522 0.0432099 -0.001486 0.0506721 -0.0222153 -0.0058554 -0.002 unknown
polarizability: 57.0175442|-12.5077644|58.2032355|9.1360321|-2.0126962|32.9070169 unknown
InChI: InChI=1S/C2HClF3I/c3-2(5,6)1(4)7/h1H
charge 0 multiplicity 1
8 atoms
I  2.274196 -1.177342 0.108465
Cl -1.367781 -1.603452 -0.55591
F  -0.631285 -0.013519 1.463828
F  -1.521192 1.043394 -0.333151
F  1.140285 1.580598 -0.183826
C  -0.651491 -0.005127 0.059015
C  0.743937 0.25727 -0.553369
H  0.693432 0.188578 -1.650052
