program: Gaussian 09
title: 000078962
version: EM64L-G09RevD.01
frameworkgroup: C1[X(C7H10)]
method: RPBEPBE
basis: SDD
operation: Freq
keyword: #p
keyword: freq=noraman
keyword: PBEPBE/SDD
title: #p freq=noraman PBEPBE/SDD
converged: NO NO NO NO
title: Mulliken charges:
elementType: C C C C C C C H H H H H H H H H H
charge: -0.233236 -0.233074 -0.233241 -0.198961 -0.444510 -0.444985 -0.444745 0.249638 0.249595 0.249573 0.238202 0.207585 0.207585 0.207682 0.207659 0.207733 0.207500
chargesum: 0.00000
title: Mulliken charges with hydrogens summed into heavy atoms:
elementType: C C C C C C C
charge: 0.016402 0.016520 0.016332 0.039241 -0.029340 -0.029644 -0.029512
polarizability: 6.35527058e+01 8.60394333e-04 6.52671437e+01 -1.59802486e-04 6.94854912e-04 6.52650055e+01
1716.lowfreq: -23.8986 0.0006 0.0006 0.0007 23.0208 28.4129 410.6185 416.6725 423.6644
frequency: 410.6118 416.6520 423.6483 633.0427 633.7786 769.3608 794.5254 795.2980 887.4543 889.5610 893.1375 913.6156 914.3241 925.5621 946.9202 982.5088 983.2313 1034.0571 1055.7119 1056.4226 1060.7000 1118.4236 1119.3159 1119.7962 1212.5119 1213.7715 1247.7685 1249.7806 1250.1150 1291.3635 1292.8786 1351.5727 1458.4993 1460.4377 1483.3807 2993.5075 2994.9862 3000.2996 3054.3000 3062.2108 3063.2556 3095.3066 3157.7877 3158.1087 3181.4454
redmass: 1.7095 1.7821 1.9279 4.3555 4.3595 4.4028 1.7265 1.7350 2.1611 2.1561 2.5113 2.0594 2.0491 1.3814 4.7356 1.3007 1.3016 1.0709 1.6750 1.6603 1.1525 1.3169 1.3048 1.3178 1.8544 1.8777 2.2761 1.3853 1.3524 1.7221 1.7270 2.5675 1.0952 1.0957 1.1005 1.0585 1.0584 1.0595 1.1053 1.1060 1.1060 1.0914 1.0915 1.0915 1.1019
irintensity: 0.5176 0.3705 0.1211 0.0843 0.0749 0.4524 28.0467 28.0264 0.0162 0.0252 9.3630 3.5448 3.5115 0.0067 1.9586 0.0201 0.0380 0.0005 0.3246 0.3408 0.2959 0.0175 0.0132 0.0088 3.7700 3.9848 7.2266 1.0222 0.5794 6.0671 5.9365 1.1279 7.7037 7.5474 1.4572 68.4474 70.0842 19.7592 0.9720 53.8132 55.4600 49.3313 10.6381 10.6523 28.5590
temp: 298.150 k
press: 1.00000 atm
elementType: 6 6 6 6 6 6 6 1 1 1 1 1 1 1 1 1 1
symmnumber: 1
zpe: 395072.4 jmol-1
zpe.correction: 0.150475 hartree
zpe.thermalcorrener: 0.155476 hartree
zpe.thermalcorrenthalpy: 0.156420 hartree
zpe.thermalcorrgfe: 0.122218 hartree
zpe.sumelectzpe: -272.169719 hartree
zpe.sumelectthermal: -272.164719 hartree
zpe.sumelectthermalent: -272.163775 hartree
zpe.sumelectthermalfe: -272.197976 hartree
dipole: 0.1226 0.0000 0.0001
dipole: 0.1226
quadrupole: -41.6899 -42.9296 -42.9352
quadrupole: 0.0014 0.0000 -0.0008
quadrupole: 0.8283 -0.4114 -0.4170 0.0014 0.0000 -0.0008
hfenergy: -272.3201943 hartree
pointgroup: C01 [X(C7H10)]
dipole: -0.0482183 -0.0000495 0.0000025 debye
dipolederiv: 0.0345785 0.0007917 -0.0016177 -0.0058965 0.0311185 0.0817066 0.0135378 0.0819412 -0.1255644 0.0345393 -0.0016725 0.0001953 0.0149241 -0.1575477 0.0265575 -0.0018174 0.026705 0.0618929 0.0345673 0.001069 0.0013427 -0.0088926 -0.0160458 -0.1087385 -0.0118812 -0.1088645 -0.0792159 0.094108 0.0000211 0.000016 0.0001779 0.0570645 0.0002434 0.0000448 -0.0000527 0.0573062 -0.0036005 -0.0316697 0.0739118 -0.0254642 0.1407322 0.0618231 0.0597352 0.0616352 0.0225928 -0.0036528 0.0798534 -0.0095766 0.0646438 -0.0015683 0.0205377 -0.0077688 0.0206677 0.1649095 -0.0035544 -0.048253 -0.0643103 -0.0391054 0.1056473 -0.082066 -0.0518663 -0.0820898 0.0572789 -0.0782324 -0.0363271 0.0847508 -0.0335209 0.0984486 0.0553778 0.078171 0.0554382 -0.00739 -0.07826 0.0914481 -0.0111063 0.0842979 -0.0287968 0.0182958 -0.0101697 0.0182194 0.1200208 -0.0780225 -0.0552835 -0.0736279 -0.0511065 0.0669411 -0.073616 -0.0679748 -0.0735482 0.0240375 -0.1955862 -0.0001171 -0.0000722 -0.0001529 0.0652118 0.0000195 -0.000156 0.0000204 0.0650735 0.0405681 -0.0142617 -0.0680576 -0.0415943 0.0110442 -0.1399631 -0.0613861 -0.0764233 -0.13157 0.0405867 0.0591186 -0.0368783 0.0731794 -0.1712284 0.0983439 -0.012496 0.0349485 0.0509827 0.0405322 -0.0518363 0.0464558 -0.0324639 -0.0020048 0.0839684 0.066692 0.147524 -0.1182069 0.0405523 -0.0615443 -0.0328024 -0.0474223 -0.0623851 -0.097993 -0.0570942 -0.1613976 -0.0580915 0.0403822 0.0663142 0.0218427 0.0742122 -0.1893638 -0.0397434 -0.005181 0.0236817 0.0691637 0.0404941 0.0023491 0.0695342 -0.0258157 0.0527326 0.0952462 0.0696108 0.0315949 -0.1732199 unknown
polarizability: 63.5527084|-0.0016313|65.2647981|0.0015711|-0.0000027|65.2673485 unknown
InChI: InChI=1S/C7H10/c1-4-2-6-5(1)7(6)3-4/h4-7H,1-3H2
charge 0 multiplicity 1
17 atoms
C  0.939498 0.351094 -0.820768
C  0.939842 -0.885939 0.106717
C  0.939227 0.536151 0.714128
C  -1.211774 -0.000164 -0.000628
C  -0.514744 0.550499 -1.289448
C  -0.514675 -1.391563 0.167859
C  -0.515673 0.840575 1.121397
H  1.793917 0.618803 -1.446337
H  1.794418 -1.561223 0.188571
H  1.793112 0.944843 1.25897
H  -2.311492 -0.000737 -0.001109
H  -0.761056 -0.044902 -2.188438
H  -0.761981 1.611353 -1.481212
H  -0.761555 -1.871854 1.132963
H  -0.761503 -2.088047 -0.655157
H  -0.763679 1.916498 1.056729
H  -0.762283 0.474112 2.135363
