program: Gaussian 09
title: 000078946
version: EM64L-G09RevD.01
frameworkgroup: C1[X(C8H12O)]
method: RPBEPBE
basis: SDD
operation: Freq
keyword: #pfreq=noraman
keyword: PBEPBE/SDD
title: #p freq=noraman PBEPBE/SDD
converged: NO NO NO NO
title: Mulliken charges:
elementType: O C C C C C C C C H H H H H H H H H H H H
charge: -0.460104 -0.218227 -0.071876 -0.200790 -0.520613 -0.517100 -0.239509 -0.233813 -0.410196 0.261331 0.249079 0.233628 0.246380 0.212421 0.228838 0.215283 0.242683 0.236969 0.207259 0.197291 0.341067
chargesum: 0.00000
title: Mulliken charges with hydrogens summed into heavy atoms:
elementType: O C C C C C C C C
charge: -0.119037 0.043104 0.177202 0.032838 -0.061813 -0.072979 0.003174 0.003156 -0.005647
polarizability: 8.97365224e+01 4.16114486e+00 7.79348430e+01 -2.35743256e+00 -1.70446804e-01 7.45143989e+01
1716.lowfreq: 0.0004 0.0007 0.0008 8.0574 19.7033 28.2972 83.7816 150.1646 217.4931
frequency: 83.4518 150.1344 217.4801 277.6703 342.1025 381.5302 451.4034 467.1338 525.3468 651.0642 726.2221 736.0547 782.0663 824.9708 831.4248 896.9765 915.7620 929.1948 933.8757 946.5417 964.6584 974.4911 990.2321 1029.5451 1057.4888 1060.4065 1082.6376 1117.0703 1133.4958 1152.5035 1178.0556 1194.3834 1240.4243 1253.6295 1257.2278 1261.6620 1271.8810 1297.6488 1318.9963 1349.8823 1407.7366 1465.0770 1476.1452 1476.8555 1579.3459 2926.3926 2975.2649 2996.3121 3001.8443 3015.5865 3058.6961 3076.8391 3084.7605 3106.7986 3147.5788 3181.7316 3566.7450
redmass: 4.3847 3.4717 2.3554 1.1124 2.4556 3.2769 2.4147 1.9459 3.0132 3.5679 1.5843 3.1490 3.6348 2.2336 2.9687 2.2153 1.7711 2.1966 1.5335 2.8618 1.8598 2.1806 2.3362 1.8445 1.8654 1.4491 1.1706 1.1732 1.1932 1.5849 1.3518 1.2169 1.5221 1.5099 1.3511 1.2896 1.5293 1.5181 1.6119 1.4263 1.4750 1.0901 1.0869 1.0928 5.6640 1.0551 1.1036 1.0607 1.0622 1.0867 1.1039 1.0908 1.1036 1.0912 1.0872 1.1095 1.0665
irintensity: 1.9494 5.3521 17.4538 144.9213 3.6958 2.1772 4.7720 1.0768 15.0536 1.3263 59.7362 2.9034 1.9399 7.3756 13.9401 2.3801 2.3817 12.6417 1.3593 14.2576 2.7647 24.1213 34.0609 11.6091 0.5175 15.5294 2.7353 1.6428 15.3196 5.5793 0.1650 2.3247 14.8553 14.2814 3.9851 0.6939 4.5853 0.4248 12.5427 4.9698 1.4148 8.7945 11.7543 1.1436 2.1589 60.2356 34.4862 46.1651 36.4780 51.1236 33.5026 63.0815 41.6037 19.5711 9.7512 21.3683 1.7088
temp: 298.150 k
press: 1.00000 atm
elementType: 8 6 6 6 6 6 6 6 6 1 1 1 1 1 1 1 1 1 1 1 1
symmnumber: 1
zpe: 477312.6 jmol-1
zpe.correction: 0.181799 hartree
zpe.thermalcorrener: 0.189712 hartree
zpe.thermalcorrenthalpy: 0.190656 hartree
zpe.thermalcorrgfe: 0.149501 hartree
zpe.sumelectzpe: -386.522089 hartree
zpe.sumelectthermal: -386.514176 hartree
zpe.sumelectthermalent: -386.513231 hartree
zpe.sumelectthermalfe: -386.554387 hartree
dipole: -0.4587 0.8610 -1.5492
dipole: 1.8308
quadrupole: -51.1924 -54.3768 -53.8712
quadrupole: 1.4470 4.4893 1.2954
quadrupole: 1.9544 -1.2300 -0.7244 1.4470 4.4893 1.2954
hfenergy: -386.7038876 hartree
pointgroup: C01 [X(C8H12O1)]
dipole: -0.1789829 -0.3388358 0.6098774 debye
dipolederiv: -0.692233 0.1041308 -0.2544009 0.1461262 -0.6138107 0.017303 -0.3326626 0.0411263 -0.2827857 0.0535808 -0.0061176 0.0314113 -0.0154324 0.0123589 -0.11235 0.0882689 -0.0783795 0.0642011 -0.0226727 0.0363434 -0.008282 0.0827692 0.0681076 0.0391033 0.0031279 0.0227586 0.0448713 0.1960101 -0.1105313 -0.0028381 -0.0132115 0.0584522 -0.0503959 -0.0171808 -0.0185215 -0.0184608 -0.0268339 0.1065059 -0.0289959 0.0787743 0.0854261 0.0866832 -0.0290409 0.070691 0.0636389 -0.0405333 0.0543563 -0.0214389 0.0019774 0.0298239 0.0566116 0.0041841 0.0065556 0.1105981 -0.0723205 -0.0576356 0.1253738 -0.069522 -0.1066525 0.1191004 0.1005646 0.1988931 -0.0402429 -0.2465542 -0.1043909 0.0622369 -0.0922797 0.0329193 0.1184505 0.1253004 0.0710543 -0.0073062 0.6113996 -0.1223119 0.183507 -0.189489 0.4528743 -0.0362004 0.1363849 -0.0586248 0.2557526 0.0231325 0.0598014 -0.0782624 0.0506254 -0.0043001 0.0728186 -0.0752431 0.074285 -0.0249522 -0.0069317 -0.0318867 -0.0483301 -0.0870075 -0.0041761 -0.0997985 -0.044696 -0.0852787 -0.087793 -0.1455131 0.1128777 -0.0312426 0.1028523 -0.0100228 0.0209294 -0.0313539 0.0159002 0.0622399 -0.0736385 -0.0924536 0.0911805 -0.1221914 -0.0236388 0.0834923 0.0515278 0.0397836 0.0298395 0.0837428 -0.0373579 -0.0395531 -0.0055451 -0.0554078 -0.1691899 -0.0031879 -0.1227755 -0.0801777 0.0503308 -0.0255171 0.0004942 0.0263083 -0.1787821 -0.0508329 0.0117721 -0.1130685 0.0353905 0.0379753 -0.0163986 0.060512 -0.0223617 0.0553213 0.0165759 0.0479163 0.0828084 -0.1572425 0.1022406 0.1112626 0.0048068 0.0830715 -0.0217596 -0.0991614 -0.015811 -0.1192262 0.0648522 0.1109799 0.0157621 -0.1016186 0.0222183 0.0885167 -0.0554283 -0.1313285 -0.0835665 -0.0605469 0.0127573 0.0067112 -0.1074989 0.0322471 -0.0269442 -0.0941956 -0.1014709 -0.0385577 -0.134677 -0.0901113 -0.0743074 0.0295803 -0.073801 -0.1741378 0.116968 0.008103 0.0965665 0.0123535 0.1351923 0.0711572 0.1333588 0.0638712 0.335832 0.019517 0.2048255 -0.0024239 0.1504471 unknown
polarizability: 89.467601|-4.6863111|78.3193808|1.8952599|-0.0981427|74.3987824 unknown
InChI: InChI=1S/C8H12O/c9-5-8-4-6-1-2-7(8)3-6/h1-2,6-9H,3-5H2
charge 0 multiplicity 1
21 atoms
O  -2.880459 0.47559 -0.194941
C  0.058583 0.650024 -0.815589
C  -0.735345 -0.628229 -0.321662
C  1.691181 -0.624335 0.141852
C  1.386861 -0.034829 -1.273489
C  0.385009 -1.482809 0.380472
C  0.550482 1.395819 0.430854
C  1.531801 0.636106 1.002468
C  -1.928594 -0.334228 0.587109
H  -0.494981 1.247286 -1.552933
H  -1.116495 -1.158316 -1.215564
H  2.630459 -1.18474 0.267603
H  2.14851 0.689492 -1.608394
H  1.235153 -0.811151 -2.047371
H  0.4790 -2.481408 -0.084048
H  0.192416 -1.627622 1.459755
H  0.11177 2.318434 0.821346
H  2.046816 0.815317 1.951061
H  -1.588073 0.214933 1.49196
H  -2.399875 -1.288938 0.910431
H  -3.673618 0.679905 0.361178
