program: Gaussian 09
title: 000001964
version: EM64L-G09RevD.01
frameworkgroup: C1[X(C18H20O5)]
method: RPBEPBE
basis: SDD
operation: Freq
keyword: #pfreq=noraman
keyword: PBEPBE/SDD
title: #p freq=noraman PBEPBE/SDD
converged: NO YES NO NO
title: Mulliken charges:
elementType: O O O O O C C C C C C C C C C C C C C C C C C H H H H H H H H H H H H H H H H H H H H
charge: -0.259271 -0.204958 -0.220225 -0.416742 -0.433771 -0.067446 -0.072406 -0.454990 -0.569228 -0.023152 -0.530011 -0.589225 0.178961 -0.745996 -0.100135 -0.353920 0.112522 0.446074 -0.014501 0.206556 -0.642522 0.365467 -0.567974 0.249043 0.241125 0.202721 0.221434 0.250634 0.230329 0.239586 0.249809 0.244609 0.219729 0.230005 0.244674 0.225067 0.217013 0.250200 0.227965 0.237876 0.250975 0.363597 0.360501
chargesum: 0.00000
title: Mulliken charges with hydrogens summed into heavy atoms:
elementType: O O O O O C C C C C C C C C C C C C C C C C C
charge: -0.259271 -0.204958 -0.220225 -0.053145 -0.073270 0.181597 0.168719 -0.030835 -0.088265 0.216434 -0.035593 -0.139490 0.178961 -0.059241 0.150065 -0.125955 0.112522 0.446074 -0.014501 0.206556 -0.404647 0.365467 -0.316998
polarizability: 3.02517358e+02 1.38407021e+00 2.03782212e+02 -7.76366182e+00 -1.20011565e+01 1.39041242e+02
1716.lowfreq: -4.1795 -0.5141 -0.0008 -0.0007 -0.0006 7.9754 35.3891 48.8667 54.5194
frequency: 35.3722 48.8160 54.5064 71.1185 85.0868 112.8332 125.7002 148.1570 175.8789 184.4484 210.6611 215.3254 232.6094 245.0504 260.0455 274.5823 287.5506 301.3094 316.7864 330.9772 339.4872 351.0885 368.8436 376.5786 394.7954 426.9938 436.2417 452.2035 483.3049 499.4455 518.3490 533.8012 559.2423 574.8102 587.3726 593.2222 614.2347 629.2685 676.7748 697.8820 720.3844 751.2553 768.2371 784.9684 810.3270 825.6232 827.3179 849.9954 869.3546 869.5989 905.7898 939.9842 949.7859 970.8081 982.7868 984.4109 1008.9405 1020.9626 1029.9416 1038.8198 1053.7396 1069.2685 1093.0475 1119.4848 1129.3816 1137.3398 1150.3463 1158.4762 1170.3266 1181.9783 1189.1398 1201.9496 1221.6073 1235.4056 1238.4706 1246.6844 1275.0631 1284.0223 1288.7202 1305.4431 1308.6733 1311.8536 1326.0289 1330.4425 1334.6026 1349.0328 1355.5382 1371.4268 1391.0171 1398.2405 1426.8588 1438.4218 1445.6045 1466.1979 1468.3387 1481.4456 1482.5763 1488.6869 1602.6294 1610.8596 1616.3204 1631.8171 1668.0545 2969.3211 2975.4999 2979.5659 2985.6691 2991.5023 2995.5536 3005.5961 3012.8984 3042.1000 3043.0643 3050.1891 3063.3654 3084.1777 3090.5857 3098.1568 3101.8836 3123.4622 3151.2928 3583.1129 3585.0350
redmass: 6.7029 5.2300 5.1214 7.2174 5.2675 4.4196 4.8942 3.2745 3.6093 2.7335 1.3356 5.0075 3.8807 3.1089 3.4380 3.0012 4.1164 3.0330 2.8539 2.7388 1.5444 4.2025 1.1713 3.4080 3.3434 3.3509 3.3026 4.6618 3.9914 3.7116 4.3511 2.7640 5.9106 3.8763 5.9922 3.3738 3.1472 2.8080 4.2584 4.7943 3.8527 3.8654 2.5447 5.6920 1.6726 3.1254 1.7940 2.3166 1.9861 2.0157 1.9454 1.9500 2.4856 1.8178 3.5285 1.4586 5.0826 2.3205 1.8696 3.0400 1.8096 1.9784 2.4647 2.1382 1.8099 1.5338 2.1837 1.5249 1.5972 1.8241 1.3125 1.3717 2.6207 1.6663 1.4864 1.5563 1.3094 1.3545 1.4334 1.3186 1.3440 1.3807 1.5353 1.2380 1.4330 3.9983 1.4698 1.3822 5.6169 1.2617 1.0811 1.0835 3.4078 1.1115 1.0571 1.1638 2.7590 1.0784 6.9653 7.1989 9.4289 10.6296 6.3874 1.0648 1.0649 1.0593 1.0686 1.0738 1.0371 1.0845 1.0857 1.0978 1.1013 1.0995 1.0955 1.0920 1.0992 1.0990 1.0886 1.0916 1.0925 1.0661 1.0661
irintensity: 1.4242 1.6754 6.7073 1.0010 1.1676 1.3743 1.3171 0.8471 2.6767 0.1915 0.7923 0.6887 4.7772 0.4007 1.3781 0.3575 14.5121 1.3578 7.7053 17.2314 47.9452 11.5890 185.5394 18.7006 1.7085 8.6287 2.6388 12.8851 4.0876 5.1828 0.8438 0.7797 9.8963 9.2290 9.9971 3.5700 13.3808 1.5982 11.9492 12.2769 3.7960 5.8505 0.9909 5.7781 1.7564 8.2343 28.1392 43.4442 7.0216 14.5090 3.1735 21.8877 7.7419 9.4692 54.3899 59.8234 222.6058 48.7599 20.2875 103.2998 2.3865 6.8899 14.1338 9.1852 383.5607 12.7406 17.7319 73.9805 7.0460 26.1163 30.6411 15.1769 77.8445 127.4037 6.4184 18.6929 0.5750 35.4550 2.4961 0.9171 8.2132 1.3079 13.7012 2.7208 4.4247 36.1071 13.3676 0.9308 4.5969 28.0769 18.2836 22.6232 46.5827 1.9788 9.4886 15.0665 13.8343 8.1265 61.8259 210.7015 277.6845 190.8037 20.6204 12.4362 5.5810 48.8690 6.8708 25.0826 18.9585 17.0547 9.5630 18.7167 32.4819 31.1105 16.0454 7.3645 31.0769 21.2324 23.7776 11.3097 2.8829 44.7686 53.6188
temp: 298.150 k
press: 1.00000 atm
elementType: 8 8 8 8 8 6 6 6 6 6 6 6 6 6 6 6 6 6 6 6 6 6 6 1 1 1 1 1 1 1 1 1 1 1 1 1 1 1 1 1 1 1 1
symmnumber: 1
zpe: 901545.5 jmol-1
zpe.correction: 0.343381 hartree
zpe.thermalcorrener: 0.364502 hartree
zpe.thermalcorrenthalpy: 0.365447 hartree
zpe.thermalcorrgfe: 0.294622 hartree
zpe.sumelectzpe: -1072.310690 hartree
zpe.sumelectthermal: -1072.289568 hartree
zpe.sumelectthermalent: -1072.288624 hartree
zpe.sumelectthermalfe: -1072.359448 hartree
dipole: -2.6591 0.0510 2.6658
dipole: 3.7656
quadrupole: -140.9057 -127.6295 -137.7910
quadrupole: 18.8126 3.4320 -2.0586
quadrupole: -5.4637 7.8126 -2.3490 18.8126 3.4320 -2.0586
hfenergy: -1072.6540705 hartree
pointgroup: C01 [X(C18H20O5)]
dipole: 1.0447052 0.0014045 1.0504636 debye
polarizability: 302.3993863|3.3252713|203.8923429|7.7818414|12.1138696|139.0490823 unknown
InChI: InChI=1S/C18H20O5/c1-10-15-6-5-13(19)7-11(15)3-2-4-12-8-14(20)9-16(21)17(12)18(22)23-10/h2,4,8-11,15,20-21H,3,5-7H2,1H3
charge 0 multiplicity 1
43 atoms
O  0.115724 -1.13973 0.770261
O  -5.668413 1.637771 -0.535276
O  0.624547 -1.84312 -1.396808
O  3.46449 -2.326914 -0.544555
O  5.749618 1.848342 0.329914
C  -2.206918 -0.771384 -0.09883
C  -2.341919 0.64996 0.572979
C  -3.585357 -1.449148 -0.340397
C  -3.815549 0.997035 0.934385
C  -1.25721 -1.749301 0.656322
C  -4.553029 -0.479179 -1.048776
C  -1.723901 1.798316 -0.308378
C  -4.767499 0.807289 -0.243563
C  -1.648212 -2.100069 2.094665
C  -0.287291 1.46366 -0.626417
C  0.773564 1.747483 0.177332
C  0.92413 -1.181194 -0.375496
C  2.085691 1.065724 0.072374
C  2.156645 -0.337547 -0.200605
C  3.437379 -0.947573 -0.312582
C  3.279505 1.804408 0.271647
C  4.534564 1.168846 0.159541
C  4.624724 -0.207579 -0.1340
H  -1.76331 -0.637652 -1.105306
H  -1.757939 0.647008 1.512985
H  -4.036574 -1.778825 0.615377
H  -3.445267 -2.358897 -0.955209
H  -3.908967 2.031843 1.30886
H  -4.156541 0.321935 1.747694
H  -1.156035 -2.667098 0.044198
H  -5.541212 -0.93743 -1.240832
H  -4.152556 -0.191782 -2.043244
H  -1.793805 2.745369 0.261313
H  -2.321391 1.922035 -1.232642
H  -0.868153 -2.735029 2.547384
H  -1.755592 -1.197403 2.72142
H  -2.599383 -2.660242 2.116552
H  -0.117837 0.807505 -1.492027
H  0.652155 2.455386 1.010708
H  3.214511 2.880215 0.477172
H  5.613048 -0.675392 -0.199798
H  4.394183 -2.658745 -0.609686
H  5.594883 2.804702 0.529843
