program: Gaussian 09
title: 000078888
version: EM64L-G09RevD.01
frameworkgroup: C1[X(C5H7N3O2)]
method: RPBEPBE
basis: SDD
operation: Freq
keyword: #pfreq=noraman
keyword: PBEPBE/SDD
title: #p freq=noraman PBEPBE/SDD
converged: YES YES NO NO
title: Mulliken charges:
elementType: O O N N N C C C C C H H H H H H H
charge: -0.172134 -0.238285 -0.196574 -0.009856 0.072554 0.424587 0.143625 -0.623575 -0.410161 -0.786519 0.270478 0.270372 0.234403 0.272175 0.246170 0.246517 0.256223
chargesum: 0.00000
title: Mulliken charges with hydrogens summed into heavy atoms:
elementType: O O N N N C C C C C
charge: -0.172134 -0.238285 -0.196574 -0.009856 0.072554 0.424587 0.143625 0.151679 -0.137986 -0.037608
polarizability: 1.25695113e+02 -2.49822536e+00 9.31254997e+01 4.08863289e-02 5.07015903e-02 4.27209363e+01
1716.lowfreq: -11.3876 -4.8145 -0.0010 -0.0006 -0.0003 3.4273 41.6186 109.3760 160.2522
frequency: 41.5954 109.3745 160.2294 185.7830 213.2595 245.6782 286.2729 312.7671 367.7518 406.7328 543.8645 617.4955 643.8851 645.1640 696.7798 714.1032 760.6459 838.3081 923.8431 986.4957 1042.8165 1103.2741 1122.8882 1148.5984 1177.0554 1240.7431 1285.7890 1328.0054 1356.1953 1381.9788 1393.9035 1409.0086 1451.4783 1457.5658 1475.1608 1476.3909 1487.0146 1530.3882 2980.8796 3023.5032 3056.2534 3104.6013 3123.6844 3131.3026 3231.5289
redmass: 6.9212 3.8329 1.0741 1.0454 5.7739 3.7887 4.1927 2.7526 5.0363 7.9945 4.7263 9.2094 4.9771 3.5411 12.3627 5.8143 10.7501 1.3255 3.6111 1.4617 1.4833 2.2788 1.3284 4.7357 2.8473 3.3365 2.9302 5.7434 11.9208 6.1478 2.8980 1.3802 1.2015 1.0407 1.0987 1.0481 1.3715 3.9912 1.0389 1.0330 1.0982 1.0967 1.1020 1.1028 1.0991
irintensity: 1.4881 0.2078 0.2660 0.1931 1.6090 0.8673 1.2624 1.7880 0.3879 0.1196 0.3840 5.2060 2.5134 8.6832 0.8304 4.7950 27.0159 27.8109 9.7993 3.6688 5.5164 0.6541 0.5309 188.2458 14.8071 46.2218 14.2420 106.1000 225.7601 67.2596 9.2240 17.5730 24.6035 29.3077 1.7508 2.4871 3.2003 52.0525 19.7581 18.3559 13.7868 9.5494 6.7146 10.9138 3.9690
temp: 298.150 k
press: 1.00000 atm
elementType: 8 8 7 7 7 6 6 6 6 6 1 1 1 1 1 1 1
symmnumber: 1
zpe: 330289.2 jmol-1
zpe.correction: 0.125801 hartree
zpe.thermalcorrener: 0.135235 hartree
zpe.thermalcorrenthalpy: 0.136179 hartree
zpe.thermalcorrgfe: 0.090754 hartree
zpe.sumelectzpe: -508.584091 hartree
zpe.sumelectthermal: -508.574657 hartree
zpe.sumelectthermalent: -508.573712 hartree
zpe.sumelectthermalfe: -508.619137 hartree
dipole: 7.3055 2.9494 -0.0051
dipole: 7.8784
quadrupole: -61.7256 -59.5961 -57.4251
quadrupole: -0.9393 0.0053 -0.0291
quadrupole: -2.1433 -0.0139 2.1572 -0.9393 0.0053 -0.0291
hfenergy: -508.7098917 hartree
pointgroup: C01 [X(C5H7N3O2)]
dipole: -2.8222332 1.2756164 -0.124094 debye
dipolederiv: -0.8755556 0.2331484 -0.0271429 0.3202823 -0.5343521 0.0291457 -0.032918 0.0280668 -0.2048767 -0.6113932 -0.0993435 0.00173 -0.2854485 -0.816022 0.0373722 0.0142466 0.0397114 -0.2456336 0.1788957 -0.0338155 0.0058973 -0.098376 -0.6534828 0.0372901 0.0117121 0.0368853 -0.0688697 0.1994243 0.0411419 0.0033103 0.3607425 -0.3968395 0.0178288 -0.0194037 0.0131625 -0.2026528 1.9887356 0.0078726 0.0268816 0.1423033 1.1498956 -0.0694469 0.018165 -0.0708494 0.1859252 0.2007214 0.1045583 -0.0038389 -0.6736526 0.2226313 -0.0245647 0.0477218 -0.0132712 -0.0018501 -0.8902611 -0.2407241 0.0014692 -0.4657668 0.3188026 -0.0194939 0.0166463 -0.0171086 0.0984257 0.1745881 -0.0164933 0.0005048 0.0093988 0.356203 -0.0123591 -0.0017908 -0.0115758 0.1803658 -0.4262665 0.0276525 -0.0053887 0.5492513 0.1173943 -0.0111602 -0.0393848 -0.0187428 -0.1750654 -0.0872192 0.0080391 -0.0027036 0.1608991 0.0251777 0.0063686 -0.0147288 0.0044547 0.0848562 0.0714128 -0.055474 -0.0677026 0.007956 0.0386651 -0.0105485 -0.051168 -0.0436511 -0.0079559 0.0692444 -0.0459379 0.075481 0.0145698 0.0434484 0.0042563 0.0511518 0.0366559 -0.0133002 -0.0851858 0.1307972 -0.0098137 0.0316231 0.0442256 0.0049433 -0.0035264 0.0057126 0.111244 0.0304542 -0.0570521 0.0015756 -0.0721075 0.0482353 0.0078329 0.0029608 0.0081394 0.1842754 0.0200494 0.0250802 -0.0110434 0.0733298 0.0094777 -0.1052948 0.0413823 -0.1085578 -0.0117271 0.0202259 0.0240508 0.0083542 0.0648119 0.0391776 0.0995011 -0.0495719 0.1017843 -0.0419844 0.0221298 -0.0535007 0.0024298 -0.1398166 -0.0126379 0.0083291 0.0085056 0.009184 0.1288234 unknown
polarizability: 125.8302558|1.1911297|92.7407149|1.1414045|-3.4045527|42.970578 unknown
InChI: InChI=1S/C5H7N3O2/c1-4-3-6-5(7(4)2)8(9)10/h3H,1-2H3
charge 0 multiplicity 1
17 atoms
O  2.772592 -0.918131 0.099042
O  2.180222 1.288505 -0.070171
N  -0.551452 0.589007 -0.053664
N  0.047936 -1.616378 0.099519
N  1.894226 0.016287 0.017988
C  -1.735584 -0.156766 -0.021867
C  0.495254 -0.346581 0.02256
C  -0.479194 2.060679 -0.151284
C  -1.331631 -1.506325 0.07215
C  -3.108789 0.439444 -0.081047
H  0.055195 2.478329 0.715097
H  0.066869 2.360355 -1.058521
H  -1.504545 2.459418 -0.18524
H  -1.969082 -2.386351 0.120467
H  -3.304646 1.126774 0.763307
H  -3.281851 1.000431 -1.018674
H  -3.856621 -0.368197 -0.032962
