program: Gaussian 09
title: 000078885
version: EM64L-G09RevD.01
frameworkgroup: C1[X(C17H14N4O3)]
method: RPBEPBE
basis: SDD
operation: Freq
keyword: #p
keyword: freq=noraman
keyword: PBEPBE/SDD
title: #p freq=noraman PBEPBE/SDD
converged: NO NO NO NO
title: Mulliken charges:
elementType: O O O N N N N C C C C C C C C C C C C C C C C C H H H H H H H H H H H H H H
charge: -0.280018 -0.177951 -0.177856 -0.511704 -0.511634 0.074406 0.074411 0.538829 0.539889 0.336114 0.336060 0.263072 0.262802 -0.631011 -0.630943 -0.362873 -0.363330 -0.377410 -0.377123 0.275911 -0.801285 -0.801044 -0.132754 -0.132476 0.237030 0.237073 0.309736 0.309486 0.237740 0.237841 0.292867 0.292969 0.236879 0.231143 0.238507 0.231112 0.238566 0.236971
chargesum: 0.00000
title: Mulliken charges with hydrogens summed into heavy atoms:
elementType: O O O N N N N C C C C C C C C C C C C C C C C C
charge: -0.280018 -0.177951 -0.177856 -0.218838 -0.218665 0.074406 0.074411 0.538829 0.539889 0.336114 0.336060 0.263072 0.262802 -0.393981 -0.393870 -0.053137 -0.053844 -0.139670 -0.139281 0.275911 -0.094756 -0.094395 -0.132754 -0.132476
polarizability: 4.43502242e+02 3.15508655e-02 2.53809694e+02 -2.32523836e-01 -1.96138069e-01 9.26057222e+01
1716.lowfreq: -42.9293 -39.3189 -0.0012 -0.0010 -0.0006 5.7572 9.0765 12.3488 19.4276
frequency: -42.8845 -39.3187 19.2646 29.9178 54.3381 56.7068 58.9585 79.5645 82.2516 130.2214 132.2544 147.0356 153.5329 161.4220 175.4603 246.8294 249.9101 269.2256 279.6016 293.1048 308.9927 323.3844 335.7451 403.9136 413.6277 440.8643 451.2675 462.9153 468.4944 472.0328 476.8896 481.6200 485.5652 494.3539 504.9455 601.7818 602.1313 624.8943 632.4021 680.8472 697.2607 714.2794 715.6572 717.5121 741.4966 783.8323 794.0256 846.3178 848.2349 873.9866 876.0311 896.9117 908.7784 979.4120 981.0468 996.2678 997.5097 1025.8752 1045.0964 1045.1230 1062.8994 1064.9954 1157.6874 1158.6767 1175.1127 1214.1327 1215.4192 1247.3234 1263.5235 1288.4752 1299.0094 1353.4171 1362.5048 1382.2082 1383.9230 1404.1028 1404.2559 1454.3766 1462.9397 1467.1887 1467.2722 1472.8152 1474.2621 1506.6338 1520.6499 1533.2201 1533.9452 1584.8829 1588.3742 1621.3748 1624.0190 1656.7845 2389.4568 2392.5041 2972.8721 2972.9979 3047.3772 3047.4941 3086.4883 3086.6212 3119.9781 3121.1911 3136.1456 3136.3480 3200.2436 3201.2720 3518.6620 3531.1156
redmass: 10.9151 13.0688 6.4263 5.0549 6.1695 9.3846 5.2289 5.2398 6.8197 1.2427 1.1068 2.3183 2.5768 5.5376 8.0335 4.6907 6.0708 3.7204 3.7177 6.7212 13.7727 2.7911 3.7889 6.4097 6.8503 2.0104 3.2642 3.8041 8.6501 3.5472 8.2353 11.8159 9.7479 4.7528 4.1441 1.8335 3.7227 4.6086 2.5443 7.1668 11.6538 6.3838 2.6385 2.6441 4.6177 6.6511 5.4575 1.2764 1.2756 1.7404 1.7336 5.5256 5.1094 1.3191 1.3158 1.4818 1.5046 4.5005 1.5171 1.5170 3.1798 3.6369 1.3493 1.3152 2.7598 1.9112 2.1224 2.7218 1.8352 1.5055 1.9119 3.9300 4.5282 5.4913 4.5739 1.2479 1.2446 2.5235 3.0345 1.0461 1.0586 1.2109 1.2190 2.5320 3.0985 4.1760 3.8016 4.7221 5.1450 6.6516 6.5435 3.9780 12.7323 12.7350 1.0379 1.0379 1.0973 1.0973 1.0985 1.0985 1.0921 1.0921 1.0911 1.0911 1.0943 1.0942 1.0768 1.0757
irintensity: 0.2452 0.1568 0.0003 0.1781 0.1762 9.9699 0.0219 0.0004 4.1183 3.3463 0.0851 1.9343 0.0134 12.9927 0.1420 0.0002 0.9264 1.4802 0.9431 3.6764 7.6001 0.0109 0.7840 0.0996 0.1085 0.0266 1.9318 0.0191 37.8286 0.0248 1.2141 18.2766 38.7927 0.0168 0.3894 114.5509 33.4179 0.0032 15.0040 3.4380 21.5967 8.2998 0.0064 7.9616 1.9745 0.2143 5.4365 0.3098 35.9733 0.7044 132.5524 26.0999 4.8723 0.2499 7.9067 61.0433 2.2748 5.2156 0.2302 11.3908 58.0833 60.7567 0.3443 3.5213 566.4575 30.3179 0.3268 119.5384 34.1401 83.2863 5.9917 30.7199 526.9228 1.9398 27.7136 1.6493 30.5109 0.0412 39.0616 0.2868 31.1564 144.7326 29.7880 1444.5198 0.5223 95.3694 1.8424 16.0161 68.4472 304.6935 40.1567 88.8407 1819.7733 1426.0342 51.4756 17.1368 17.2077 19.2860 15.6132 17.5573 11.7481 12.3036 9.5715 18.6969 13.2812 7.7367 7.0925 15.5333
temp: 298.150 k
press: 1.00000 atm
elementType: 8 8 8 7 7 7 7 6 6 6 6 6 6 6 6 6 6 6 6 6 6 6 6 6 1 1 1 1 1 1 1 1 1 1 1 1 1 1
symmnumber: 1
zpe: 736529.4 jmol-1
zpe.correction: 0.280529 hartree
zpe.thermalcorrener: 0.301888 hartree
zpe.thermalcorrenthalpy: 0.302832 hartree
zpe.thermalcorrgfe: 0.228320 hartree
zpe.sumelectzpe: -1099.254137 hartree
zpe.sumelectthermal: -1099.232778 hartree
zpe.sumelectthermalent: -1099.231834 hartree
zpe.sumelectthermalfe: -1099.306346 hartree
dipole: 0.0128 -1.3182 -0.0202
dipole: 1.3184
quadrupole: -174.2862 -144.2487 -142.1862
quadrupole: 0.0703 -0.6053 -0.1624
quadrupole: -20.7125 9.3250 11.3875 0.0703 -0.6053 -0.1624
hfenergy: -1099.5346661 hartree
pointgroup: C01 [X(C17H14N4O3)]
dipole: 0.0052422 0.5186025 0.0089327 debye
polarizability: 443.18161|-0.0076096|253.809778|-10.6047902|0.1560861|92.9262708 unknown
InChI: InChI=1S/C17H14N4O3/c1-11-3-5-13(7-15(11)18-9-22)20-17(24)21-14-6-4-12(2)16(8-14)19-10-23/h3-8,20-21H,1-2H3
charge 0 multiplicity 1
38 atoms
O  -0.003318 1.859367 0.013232
O  -7.551891 -3.105249 0.24511
O  7.560235 -3.09339 -0.272426
N  -1.167471 -0.192693 0.059765
N  1.165381 -0.191193 -0.025181
N  -5.862182 -1.360583 0.195262
N  5.857897 -1.361639 -0.206761
C  -2.515566 0.261113 0.087076
C  2.514217 0.262831 -0.067314
C  -5.290649 1.006781 0.142187
C  5.288595 1.006351 -0.151463
C  -4.894439 -0.365381 0.157084
C  4.891487 -0.365601 -0.16046
C  -3.526668 -0.730954 0.130531
C  3.523634 -0.73018 -0.119708
C  -2.886651 1.631784 0.07119
C  2.885837 1.633195 -0.057043
C  -4.256855 1.9700 0.099718
C  4.256208 1.970514 -0.099946
C  -0.000963 0.596328 0.02203
C  -6.756825 1.393469 0.168285
C  6.754754 1.391885 -0.19281
C  -6.704907 -2.223597 0.218039
C  6.699576 -2.225431 -0.236844
H  -3.266426 -1.797244 0.143448
H  3.262641 -1.796199 -0.128358
H  -2.11393 2.400925 0.040069
H  2.114071 2.402839 -0.018956
H  -4.534182 3.030376 0.088574
H  4.534762 3.030596 -0.092984
H  -1.057197 -1.209003 0.072077
H  1.056803 -1.207613 -0.036337
H  -7.276132 0.966614 1.047458
H  -6.873562 2.489997 0.204964
H  -7.291643 1.025699 -0.728682
H  6.8720 2.488242 -0.232454
H  7.298184 1.025177 0.699403
H  7.264977 0.963165 -1.076376
