program: Gaussian 09
title: 000078776
version: EM64L-G09RevD.01
frameworkgroup: C1[X(C15H12ClNO)]
method: RPBEPBE
basis: SDD
operation: Freq
keyword: #p
keyword: freq=noraman
keyword: PBEPBE/SDD
title: #p freq=noraman PBEPBE/SDD
converged: NO YES NO NO
title: Mulliken charges:
elementType: Cl O N C C C C C C C C C C C C C C C H H H H H H H H H H H H
charge: -0.068116 -0.259320 -0.450291 -0.695089 0.315526 0.194032 0.281857 0.200547 -0.570518 -0.384686 -0.402860 -0.387237 0.521704 -0.484127 -0.101940 -0.224240 0.212093 -0.799758 0.252096 0.252110 0.321551 0.239730 0.267395 0.242725 0.218846 0.253440 0.310510 0.238321 0.269967 0.235732
chargesum: 0.00000
title: Mulliken charges with hydrogens summed into heavy atoms:
elementType: Cl O N C C C C C C C C C C C C C C C
charge: -0.068116 -0.259320 -0.139781 -0.190883 0.315526 0.194032 0.281857 0.200547 -0.248967 -0.144956 -0.135464 -0.144512 0.521704 -0.265281 -0.101940 0.029200 0.212093 -0.055738
polarizability: 3.55617074e+02 -2.10407951e+00 1.77203629e+02 -2.25661564e-02 2.98103864e-02 7.71962162e+01
1716.lowfreq: -73.9238 -0.0004 0.0016 0.0019 1.9755 7.5985 11.6133 37.2447 59.7123
frequency: -73.9165 37.2352 59.7109 81.3053 90.5516 136.7329 167.4621 173.8198 228.4265 238.5214 263.3759 279.9071 350.4376 364.0781 378.9527 423.6697 440.3489 477.9687 507.4164 518.4086 555.4462 570.8142 572.1565 602.2515 642.8381 647.7709 671.2276 704.2220 736.3307 757.6791 770.1842 818.4725 831.5210 852.9591 870.5111 920.5662 921.9586 933.4954 944.1183 950.7918 975.2782 988.2413 1000.9287 1030.6225 1062.1091 1109.1019 1133.7504 1134.4876 1150.7542 1181.2542 1201.8425 1220.1744 1233.8894 1266.9914 1285.3101 1307.5731 1368.0435 1374.7247 1376.4949 1417.9016 1425.0822 1440.4545 1453.2971 1455.3840 1468.7989 1489.3082 1511.6742 1580.9194 1594.0201 1613.0188 1630.0136 1631.0078 2987.0002 2987.3199 3031.3697 3072.4980 3110.4692 3136.1020 3138.3508 3145.0028 3157.0405 3171.4324 3183.4914 3520.8473
redmass: 1.0533 5.5845 6.0898 4.8266 6.6785 4.0818 7.5438 5.1413 7.5195 2.0900 5.4015 4.9930 6.4480 5.9106 4.7614 2.7162 3.1186 5.2915 3.9884 3.1735 6.0798 4.7346 3.2361 2.8346 1.2023 6.2378 6.9791 3.3346 5.5814 3.2149 4.9588 1.4116 1.6564 5.0944 1.4149 1.5206 3.9762 3.6882 1.3966 1.3664 1.8237 3.2063 2.3785 1.6575 1.9708 2.2425 1.1483 1.7367 1.4631 2.1161 1.6802 1.9756 2.2895 1.5905 1.4869 2.9029 3.6539 2.9451 1.7006 3.0660 1.2880 1.8860 1.5045 3.3538 1.0471 3.6817 2.0694 7.8457 6.3888 7.5913 6.7569 5.1599 1.0611 1.0383 1.0992 1.0984 1.0884 1.0979 1.0897 1.0956 1.0930 1.0957 1.0934 1.0764
irintensity: 0.0204 0.1449 9.2452 2.0908 2.0174 0.1329 4.1290 0.0069 1.7914 10.7641 0.0162 1.2826 12.8873 6.2175 0.0272 15.1234 0.0641 0.4838 1.9912 10.3041 0.2164 17.5812 2.3762 1.5070 60.4393 1.9514 2.5081 8.0845 3.5570 0.9370 4.0101 109.6189 0.2713 32.1513 13.9289 1.1022 0.9089 8.7404 1.3746 0.8208 29.5550 34.6052 9.2382 7.7902 28.1365 16.0410 0.0454 12.4750 9.6665 11.8803 2.9464 14.0263 120.7136 11.4493 8.1426 40.7252 86.6996 19.9782 51.1272 83.9435 43.8020 106.7721 7.9933 151.3194 20.0270 181.3499 211.3994 9.6235 69.0150 15.1166 39.4936 125.6051 9.0145 10.0140 5.4078 15.4648 24.8883 7.1223 4.9591 18.5304 2.2689 6.7713 6.1118 13.0576
temp: 298.150 k
press: 1.00000 atm
elementType: 17 8 7 6 6 6 6 6 6 6 6 6 6 6 6 6 6 6 1 1 1 1 1 1 1 1 1 1 1 1
symmnumber: 1
zpe: 599610.3 jmol-1
zpe.correction: 0.228380 hartree
zpe.thermalcorrener: 0.242940 hartree
zpe.thermalcorrenthalpy: 0.243884 hartree
zpe.thermalcorrgfe: 0.185983 hartree
zpe.sumelectzpe: -1167.625392 hartree
zpe.sumelectthermal: -1167.610832 hartree
zpe.sumelectthermalent: -1167.609888 hartree
zpe.sumelectthermalfe: -1167.667788 hartree
dipole: -3.8356 3.6369 0.0112
dipole: 5.2857
quadrupole: -105.3460 -103.1143 -115.8586
quadrupole: -13.9281 -0.0666 -0.0099
quadrupole: 2.7603 4.9920 -7.7523 -13.9281 -0.0666 -0.0099
hfenergy: -1167.8537719 hartree
pointgroup: C01 [X(C15H12Cl1N1O1)]
dipole: 1.4664877 -1.4744558 0.0043893 debye
polarizability: 355.3408288|-7.3237082|177.4798738|0.0216834|-0.0304585|77.1962162 unknown
InChI: InChI=1S/C15H12ClNO/c1-9(18)17-13-3-5-15-11(8-13)6-10-7-12(16)2-4-14(10)15/h2-5,7-8,17H,6H2,1H3
charge 0 multiplicity 1
30 atoms
Cl -6.175388 0.964176 0.001046
O  4.360586 1.773509 -0.003303
N  3.887015 -0.528161 -0.001376
C  -0.774393 1.611904 -0.000433
C  0.27866 0.509089 -0.000562
C  -0.357139 -0.769256 -0.000276
C  -2.083967 0.832169 -0.000008
C  -1.81648 -0.572625 0.000073
C  1.675019 0.640302 -0.000943
C  0.429317 -1.942898 -0.000387
C  -3.402816 1.316858 0.000279
C  -2.882353 -1.50029 0.00045
C  2.462325 -0.546319 -0.001057
C  1.832382 -1.825283 -0.000804
C  -4.448096 0.36715 0.000644
C  -4.214005 -1.024452 0.000731
C  4.753754 0.570174 -0.001295
C  6.233854 0.183196 0.00258
H  -0.682768 2.26895 0.886413
H  -0.683209 2.268699 -0.887511
H  2.174267 1.610967 -0.001346
H  -0.033572 -2.935683 -0.000167
H  -3.624741 2.388303 0.000219
H  -2.695953 -2.579681 0.000522
H  2.451982 -2.731775 -0.000897
H  -5.058174 -1.71998 0.001031
H  4.333037 -1.448931 -0.001007
H  6.497986 -0.381377 0.916225
H  6.835012 1.103001 -0.028791
H  6.491356 -0.439937 -0.87405
