program: Gaussian 09
title: 000078761
version: EM64L-G09RevD.01
frameworkgroup: C1[X(C6H10N2O2)]
method: RPBEPBE
basis: SDD
operation: Freq
keyword: #p
keyword: freq=noraman
keyword: PBEPBE/SDD
title: #p freq=noraman PBEPBE/SDD
converged: YES YES NO NO
title: Mulliken charges:
elementType: O O N N C C C C C C H H H H H H H H H H
charge: -0.276845 -0.276844 -0.126173 -0.126172 -0.444996 -0.444997 0.202249 0.202247 -0.611504 -0.611504 0.258240 0.255074 0.255076 0.258242 0.228245 0.233215 0.282493 0.282493 0.228243 0.233217
chargesum: 0.00000
title: Mulliken charges with hydrogens summed into heavy atoms:
elementType: O O N N C C C C C C
charge: -0.276845 -0.276844 -0.126173 -0.126172 0.068320 0.068319 0.202249 0.202247 0.132449 0.132449
polarizability: 9.19343146e+01 -6.92024843e-01 9.88048043e+01 7.91801315e-04 -5.80328463e-04 5.40751360e+01
1716.lowfreq: -22.3077 -10.8928 -10.1625 -6.8353 -0.0007 -0.0007 0.0003 85.3163 117.2598
frequency: -8.5681 85.3069 117.0898 128.9132 154.1980 213.5667 230.8561 294.0990 326.3739 378.0839 389.4673 438.4323 548.8317 573.5594 613.1551 692.9755 719.8020 802.6590 970.6566 977.7722 997.0860 1023.7226 1083.0887 1117.9283 1126.4291 1163.5056 1211.5225 1226.2051 1242.8438 1253.1231 1304.7576 1307.1765 1405.7165 1411.8948 1422.7717 1423.9439 1457.5989 1462.9364 1483.7818 1483.8524 1489.3009 1505.5037 1610.0285 1616.8440 2957.9967 2958.6253 2975.2526 2975.5499 3037.3861 3038.6525 3054.5233 3054.7304 3119.0944 3119.2653
redmass: 2.4388 6.4593 1.3181 1.0629 1.6543 2.4403 3.7647 2.6861 3.3973 5.6577 8.4969 9.6954 3.6418 3.6867 4.1349 5.3431 5.0091 3.6202 2.0881 1.8863 2.0938 2.4706 2.4978 1.2842 1.3151 2.5793 2.2158 1.1510 1.4835 3.0463 2.2311 1.8143 1.5891 1.2322 1.3932 2.0196 1.0684 1.0686 1.0476 1.0543 1.2838 1.4979 7.6028 6.3648 1.0666 1.0666 1.0358 1.0357 1.0930 1.0929 1.1019 1.1019 1.0983 1.0983
irintensity: 5.8049 14.9731 0.1900 0.0405 0.2406 12.7908 0.8016 1.6090 0.6416 1.3682 35.0712 0.3338 1.3464 8.3932 0.5882 0.6346 8.0876 2.9493 0.5546 1.1131 36.6399 0.1952 0.0150 0.1099 0.0238 4.7926 105.6070 2.1478 21.7615 2.5242 135.7997 0.2863 0.0063 41.7235 3.5023 120.3488 32.1553 0.0458 40.9785 2.3046 22.8547 0.0183 2.4121 591.3528 19.3021 37.4028 112.8004 0.2360 8.9928 16.1062 0.6015 60.0883 2.8544 0.0001
temp: 298.150 k
press: 1.00000 atm
elementType: 8 8 7 7 6 6 6 6 6 6 1 1 1 1 1 1 1 1 1 1
symmnumber: 1
zpe: 423349.1 jmol-1
zpe.correction: 0.161245 hartree
zpe.thermalcorrener: 0.170862 hartree
zpe.thermalcorrenthalpy: 0.171806 hartree
zpe.thermalcorrgfe: 0.126376 hartree
zpe.sumelectzpe: -493.825614 hartree
zpe.sumelectthermal: -493.815997 hartree
zpe.sumelectthermalent: -493.815053 hartree
zpe.sumelectthermalfe: -493.860483 hartree
dipole: 0.0000 0.0000 0.6400
dipole: 0.6400
quadrupole: -65.9028 -63.5261 -57.8305
quadrupole: 19.5981 -0.0004 0.0004
quadrupole: -3.4830 -1.1063 4.5893 19.5981 -0.0004 0.0004
hfenergy: -493.9868587 hartree
pointgroup: C01 [X(C6H10N2O2)]
dipole: -0.0000046 -0.0000034 -0.2518038 debye
dipolederiv: -0.9528636 -0.4460807 -0.0368492 -0.1892942 -0.832695 -0.0114798 -0.0605766 -0.0411868 -0.37327 -0.9528634 -0.4460821 0.0368947 -0.1892886 -0.8326923 0.0115044 0.0605852 0.0411918 -0.373275 -0.5746127 0.0692349 -0.031701 -0.126999 -1.0743509 -0.0305704 0.0089698 0.0821834 -0.2992335 -0.574609 0.0692288 0.0317135 -0.1269959 -1.0743579 0.0305832 -0.0089539 -0.0821602 -0.2992342 0.1445248 0.3246593 0.0872947 0.3623322 0.164479 0.0588022 0.0924143 -0.0079755 0.3282183 0.1445103 0.3246603 -0.0872969 0.3623245 0.1644803 -0.0588184 -0.0924022 0.0079525 0.3282343 0.9824185 0.3309892 0.0767615 0.231253 1.503464 0.0039237 0.0976239 -0.0067906 0.1460703 0.9824123 0.330995 -0.0768107 0.231247 1.5034651 -0.0039626 -0.0976581 0.0067779 0.1460787 0.1966756 -0.2899597 -0.0046171 -0.1933697 0.1881882 -0.0129593 -0.0124865 -0.0445038 0.2665205 0.1966706 -0.2899581 0.004616 -0.1933664 0.1881911 0.0129733 0.0124812 0.0445135 0.2665202 0.0442341 -0.01403 -0.0235816 -0.0418802 -0.020347 0.0618216 -0.0162785 0.1134011 0.0220255 -0.0070829 -0.0306302 -0.0181517 -0.0587158 0.0180604 0.055715 0.0299757 0.1292421 -0.0796621 -0.0070856 -0.0306384 0.0181452 -0.0587198 0.0180576 -0.0557123 -0.0299806 -0.129241 -0.0796548 0.0442342 -0.0140369 0.023579 -0.041885 -0.0203516 -0.0618167 0.0162769 -0.1133986 0.0220271 0.0771646 0.0528792 -0.0284869 0.090122 -0.0282251 -0.0917929 0.0435586 -0.131376 -0.0772715 0.0716509 0.011433 0.0604439 0.0627642 -0.0267615 0.1102271 -0.0035457 0.1342101 -0.0628376 0.017902 -0.0084873 -0.0120849 -0.136206 0.1081909 -0.0191808 -0.0156645 -0.0044779 0.129427 0.0179015 -0.0084868 0.0120852 -0.1362058 0.1081919 0.0191766 0.0156686 0.0044738 0.1294261 0.0771703 0.0528749 0.028489 0.0901201 -0.0282257 0.0917926 -0.0435549 0.1313752 -0.0772675 0.0716474 0.0114356 -0.0604425 0.0627633 -0.0267613 -0.1102265 0.0035473 -0.1342112 -0.062842 unknown
polarizability: 92.2597312|1.6151698|98.4793877|-0.0008651|-0.0004641|54.075136 unknown
InChI: InChI=1S/C6H10N2O2/c1-7-3-6(10)8(2)4-5(7)9/h3-4H2,1-2H3
charge 0 multiplicity 1
20 atoms
O  2.378222 1.37599 0.062032
O  -2.378173 -1.375958 0.062155
N  1.254256 -0.671726 -0.001478
N  -1.254202 0.671754 -0.001423
C  0.023569 -1.449353 -0.226143
C  -0.02353 1.449375 -0.226185
C  1.30312 0.707376 -0.038361
C  -1.303069 -0.707349 -0.038253
C  2.500936 -1.442394 0.151213
C  -2.500875 1.44243 0.151293
H  -0.001478 -2.301337 0.477988
H  -0.01891 1.88721 -1.24726
H  0.018883 -1.887209 -1.247209
H  0.001559 2.301374 0.477926
H  2.676732 -2.080277 -0.73593
H  2.449315 -2.086218 1.048895
H  3.333053 -0.729576 0.255608
H  -3.332997 0.729617 0.255682
H  -2.676667 2.080332 -0.735837
H  -2.449246 2.086237 1.048987
