program: Gaussian 09
title: 000078748
version: EM64L-G09RevD.01
frameworkgroup: C1[X(C5H6N2)]
method: RPBEPBE
basis: SDD
operation: Freq
keyword: #p
keyword: freq=noraman
keyword: PBEPBE/SDD
title: #p freq=noraman PBEPBE/SDD
converged: NO YES NO NO
title: Mulliken charges:
elementType: N N C C C C C H H H H H H
charge: -0.026593 -0.034627 0.046751 -0.726219 -0.159422 -0.278289 -0.281086 0.244537 0.240313 0.239003 0.236102 0.249490 0.250040
chargesum: 0.00000
title: Mulliken charges with hydrogens summed into heavy atoms:
elementType: N N C C C C C
charge: -0.026593 -0.034627 0.046751 -0.002366 0.076680 -0.028799 -0.031046
polarizability: 8.37183539e+01 4.84129863e-01 6.69710242e+01 -4.61530281e-01 -1.62262845e-03 3.24706308e+01
1716.lowfreq: -19.4165 -13.6727 -4.3138 -0.0012 -0.0008 -0.0007 26.5086 166.5384 353.3398
frequency: 24.3299 166.5384 353.3387 393.2887 457.6325 564.0168 623.9011 764.3051 804.0700 806.2232 949.9863 958.0575 967.6057 984.3348 1056.3280 1058.7788 1098.3904 1228.1686 1250.5702 1292.9780 1391.5034 1396.5008 1416.9279 1455.6863 1461.2492 1529.4070 1540.1463 2995.8977 3083.7685 3131.6915 3132.0953 3135.5254 3175.5974
redmass: 1.0452 3.5704 2.6161 4.0290 2.3883 5.5396 7.8341 2.6869 5.3757 1.3758 8.2582 1.3920 1.6861 1.4532 1.6794 2.5779 1.4112 7.9731 1.6766 2.4398 1.2632 1.5404 2.5350 1.1100 1.0918 5.1232 4.8251 1.0399 1.0929 1.0922 1.0980 1.0931 1.0999
irintensity: 0.7386 9.7048 8.7100 0.0799 4.2332 4.1687 4.4296 12.4620 0.4789 31.0792 0.0834 0.0306 1.1476 0.4041 13.2677 0.6885 1.6901 0.7618 8.0256 0.2086 4.3005 1.1621 160.0881 19.8852 27.8860 48.0647 61.5463 6.4539 13.8691 14.7628 6.9295 19.8399 21.3104
temp: 298.150 k
press: 1.00000 atm
elementType: 7 7 6 6 6 6 6 1 1 1 1 1 1
symmnumber: 1
zpe: 267059.4 jmol-1
zpe.correction: 0.101718 hartree
zpe.thermalcorrener: 0.107893 hartree
zpe.thermalcorrenthalpy: 0.108837 hartree
zpe.thermalcorrgfe: 0.070619 hartree
zpe.sumelectzpe: -303.112885 hartree
zpe.sumelectthermal: -303.106710 hartree
zpe.sumelectthermalent: -303.105766 hartree
zpe.sumelectthermalfe: -303.143984 hartree
dipole: 1.9153 -0.0479 0.0672
dipole: 1.9171
quadrupole: -32.9277 -44.5480 -42.4170
quadrupole: 0.0499 -0.1175 0.0019
quadrupole: 7.0366 -4.5838 -2.4528 0.0499 -0.1175 0.0019
hfenergy: -303.2146029 hartree
pointgroup: C01 [X(C5H6N2)]
dipole: -0.7535168 0.017569 0.0279375 debye
dipolederiv: -0.7157761 0.0181607 -0.0000984 0.2524828 -0.3924655 0.0072134 -0.0002312 0.002786 -0.2147023 -0.7050923 -0.0148776 -0.0003084 -0.2427161 -0.3973794 -0.007301 0.0005971 -0.0016929 -0.2144875 1.0832133 0.0094251 0.0180754 0.0214964 0.2524574 0.0006142 0.0619045 0.0005169 0.065971 -0.377261 -0.0175584 -0.0167612 -0.0916535 0.0495231 -0.000473 -0.1199688 -0.0009984 0.0217593 -0.0401284 -0.0019707 -0.0022279 0.0018723 -0.4587378 -0.0004515 0.0007822 -0.0003486 -0.070152 0.3223927 0.0531697 -0.0013734 -0.1295971 0.429331 -0.0006623 -0.0085978 0.0014081 -0.0363381 0.3276688 -0.0484674 -0.0014201 0.1300645 0.4277211 0.001579 -0.00807 -0.0009472 -0.0334893 0.066765 0.0225251 0.0131336 0.0959569 -0.0543495 -0.0602076 0.0495117 -0.0481876 0.1062765 0.0562102 -0.0165217 0.0292285 -0.0399207 0.0114682 0.1083312 0.0850278 0.0894342 0.0388443 0.0388655 -0.0056051 -0.0418241 0.0018334 0.1216061 -0.0481934 -0.0665955 -0.0415552 -0.0710315 -0.106355 0.0002481 0.0018216 0.0004789 0.1058499 -0.0001034 0.0019929 -0.0000498 0.1696343 0.0250245 0.0857872 0.0009605 0.1105561 -0.0479927 -0.0008974 0.0019414 0.0005957 0.1184944 0.0244729 -0.084315 0.000794 -0.1108537 -0.0470317 0.000552 0.0017057 -0.0009611 0.1192209 unknown
polarizability: 83.7183421|0.5113489|66.9726216|0.3603694|0.0392379|32.4690451 unknown
InChI: InChI=1S/C5H6N2/c1-5-6-3-2-4-7-5/h2-4H,1H3
charge 0 multiplicity 1
13 atoms
N  0.292674 1.215372 -0.0106
N  0.290007 -1.2230 -0.013273
C  0.926299 -0.00498 -0.019219
C  2.432813 -0.000809 -0.005211
C  -1.817628 -0.000602 0.004167
C  -1.072383 1.200284 0.000975
C  -1.076522 -1.202993 -0.001609
H  2.818136 -0.988441 -0.300105
H  2.82061 0.781727 -0.67796
H  2.803277 0.230293 1.011363
H  -2.911105 0.001173 0.010223
H  -1.564516 2.179654 0.005042
H  -1.571162 -2.180979 0.000306
