program: Gaussian 09
title: 000000264
version: EM64L-G09RevD.01
frameworkgroup: C1[X(C4H8O2)]
method: RPBEPBE
basis: SDD
operation: Freq
keyword: #p
keyword: freq=noraman
keyword: PBEPBE/SDD
title: #p freq=noraman PBEPBE/SDD
converged: NO NO NO NO
title: Mulliken charges:
elementType: O O C C C C H H H H H H H H
charge: -0.418009 -0.235528 -0.345021 -0.451733 -0.679250 0.184674 0.217315 0.220548 0.244978 0.245532 0.208322 0.208610 0.223967 0.375596
chargesum: 0.00000
title: Mulliken charges with hydrogens summed into heavy atoms:
elementType: O O C C C C
charge: -0.042413 -0.235528 0.092841 0.038777 -0.038351 0.184674
polarizability: 5.99579802e+01 -1.92775869e-01 5.06077434e+01 -1.79534988e-01 3.07028717e-02 3.70288182e+01
1716.lowfreq: -2.4784 0.0013 0.0014 0.0016 6.0305 23.0730 38.6953 89.8423 170.3770
frequency: 35.2361 89.6699 170.3738 233.7346 334.1557 428.4620 505.5040 585.8764 641.4257 738.1532 844.7993 869.8101 919.3135 1037.4791 1064.5161 1105.3254 1128.4427 1220.9891 1243.0114 1286.3292 1312.6213 1371.8001 1394.4159 1438.7660 1473.0769 1479.7006 1485.5551 1662.8356 2972.7917 2986.3733 3003.7697 3029.6471 3050.3244 3076.3307 3077.2223 3507.2404
redmass: 2.0730 2.5584 3.9736 1.0749 3.6652 4.2408 1.7976 4.6624 1.3102 1.1821 3.1006 1.3304 2.2856 1.9862 2.8546 1.5917 2.2277 1.3248 1.4882 1.0860 1.6769 1.8468 1.2177 1.0853 1.0539 1.0420 1.0781 8.1063 1.0361 1.0616 1.0608 1.0976 1.1004 1.0989 1.1021 1.0639
irintensity: 0.0274 0.2170 2.0461 0.0801 4.2560 18.8425 29.0886 19.2331 130.4575 20.2018 2.4429 0.3385 43.2399 155.8012 58.5963 1.9124 44.9570 0.0299 0.2478 0.4814 35.6486 39.7066 7.6700 29.5732 4.6920 13.0955 16.2585 215.2905 32.2233 7.2148 23.0187 2.1054 0.1086 46.0756 78.8408 17.6154
temp: 298.150 k
press: 1.00000 atm
elementType: 8 8 6 6 6 6 1 1 1 1 1 1 1 1
symmnumber: 1
zpe: 303881.9 jmol-1
zpe.correction: 0.115742 hartree
zpe.thermalcorrener: 0.122978 hartree
zpe.thermalcorrenthalpy: 0.123922 hartree
zpe.thermalcorrgfe: 0.083698 hartree
zpe.sumelectzpe: -307.188561 hartree
zpe.sumelectthermal: -307.181325 hartree
zpe.sumelectthermalent: -307.180381 hartree
zpe.sumelectthermalfe: -307.220605 hartree
dipole: -0.5017 -1.4538 0.0062
dipole: 1.5379
quadrupole: -31.4470 -42.5300 -35.9033
quadrupole: -1.5919 -0.0530 -0.0873
quadrupole: 5.1798 -5.9033 0.7235 -1.5919 -0.0530 -0.0873
hfenergy: -307.3043031 hartree
pointgroup: C01 [X(C4H8O2)]
dipole: -0.1982207 -0.5716529 0.0056979 debye
dipolederiv: -0.9192541 0.5642014 0.009292 0.4855191 -0.6951897 -0.0074651 0.0132286 -0.0083219 -0.4358255 -0.654942 -0.1821436 0.001368 0.0881813 -0.9777222 -0.0033197 0.0055576 -0.0000993 -0.3083625 0.0960541 -0.0162753 0.0010966 -0.0364697 0.0650249 0.0031041 -0.001724 0.0003815 0.1508222 -0.271848 -0.0888599 0.008429 -0.2217647 -0.0935455 0.0102196 0.0229532 0.0120615 0.1543149 -0.0629925 -0.0265529 0.0015861 -0.0048608 0.0636062 0.003502 0.0011267 0.0038643 0.1052173 1.4042873 -0.1796496 -0.0208721 -0.2705381 1.4286495 0.0075983 -0.0309229 0.0057869 0.1850311 0.0368128 -0.0191743 0.0330063 0.0051452 0.0043539 0.1027971 0.0237964 0.1187428 -0.0832272 0.0420926 -0.0240209 -0.029765 0.0023033 -0.0217157 -0.1076113 -0.02344 -0.1221761 -0.0487903 0.061654 -0.0069776 0.0021199 0.0318609 0.0425777 0.0856186 -0.0085108 0.1090177 -0.0303776 0.0614455 -0.0030159 -0.0008626 0.0367301 0.0179427 -0.0925748 -0.0008982 -0.1159955 -0.0054205 0.0699021 -0.0106371 -0.0065434 -0.0525978 0.0077576 0.1198943 0.0409256 0.1277897 -0.1065025 0.0696728 -0.0103513 0.007309 -0.0586055 -0.0253032 -0.1298601 -0.0349279 -0.1379892 -0.0725124 -0.1137025 0.1077464 -0.0069752 0.1476541 -0.0218497 0.0078194 -0.0087127 0.0077862 0.102526 0.1808179 -0.1042893 0.0008114 -0.1525574 0.2054137 0.0002775 0.0015484 -0.0008484 0.3931071 unknown
polarizability: 59.9573075|-0.2072268|50.6082395|-0.1846023|-0.0447788|37.0289948 unknown
InChI: InChI=1S/C4H8O2/c1-2-3-4(5)6/h5H,2-3H2,1H3
charge 0 multiplicity 1
14 atoms
O  2.10973 -0.917802 -0.015529
O  1.371488 1.282766 0.008944
C  -1.422213 0.448552 -0.038233
C  -0.274189 -0.577703 0.026711
C  -2.804103 -0.235427 0.008372
C  1.101267 0.060694 0.005382
H  -1.324394 1.047639 -0.962963
H  -1.320174 1.162971 0.799707
H  -0.344497 -1.192475 0.946762
H  -0.330066 -1.297423 -0.813395
H  -2.93339 -0.815936 0.941694
H  -2.937325 -0.93133 -0.84169
H  -3.617271 0.511387 -0.038139
H  2.999136 -0.469114 -0.021022
