program: Gaussian 09
title: 000078772
version: EM64L-G09RevD.01
frameworkgroup: C1[X(C11H28N2O3Si)]
method: RPBEPBE
basis: SDD
operation: Freq
keyword: #p
keyword: freq=noraman
keyword: PBEPBE/SDD
title: #p freq=noraman PBEPBE/SDD
converged: YES YES NO NO
title: Mulliken charges:
elementType: Si O O O N N C C C C C C C C C C C H H H H H H H H H H H H H H H H H H H H H H H H H H H H
charge: 1.543051 -0.600767 -0.583626 -0.583454 -0.282301 -0.552620 -0.923351 -0.338600 -0.350795 -0.340732 -0.195962 -0.217347 -0.214317 -0.410242 -0.662052 -0.656007 -0.656791 0.250630 0.250515 0.203223 0.227904 0.203460 0.172779 0.239446 0.199186 0.168568 0.206893 0.200886 0.202349 0.192817 0.193309 0.202556 0.229196 0.195627 0.200047 0.226249 0.221622 0.196427 0.228958 0.230036 0.196000 0.229026 0.227670 0.263853 0.266682
chargesum: 0.00000
title: Mulliken charges with hydrogens summed into heavy atoms:
elementType: Si O O O N N C C C C C C C C C C C
charge: 1.543051 -0.600767 -0.583626 -0.583454 -0.042855 -0.022085 -0.422206 0.092527 0.025444 0.027021 0.211816 0.177819 0.181548 0.014581 -0.014134 -0.000586 -0.004095
polarizability: 1.99345708e+02 2.19800071e+00 1.65094363e+02 2.91929768e+00 -6.17245381e-01 1.46709042e+02
1716.lowfreq: -9.3537 -0.8330 -0.0006 0.0003 0.0006 4.9339 13.3200 21.4831 26.7987
frequency: 12.0838 20.4221 26.5830 30.9611 37.0173 38.3964 45.1587 50.7263 59.5713 63.5502 70.2688 86.2857 96.6750 113.2576 122.9014 139.0564 160.8498 188.2423 206.0032 216.0214 241.2917 247.2983 251.4568 259.0453 262.2986 271.5600 292.9773 329.6492 363.8702 395.0655 420.6606 469.3989 489.0192 578.9168 597.0711 671.5256 678.3621 704.9131 744.4625 777.8061 781.9494 802.2862 804.6003 807.5713 822.6013 933.4775 942.0518 944.6366 958.7392 1000.5455 1003.9957 1016.3684 1054.7380 1056.0415 1063.8718 1074.9222 1079.4143 1101.4317 1101.9463 1102.5315 1103.8085 1115.3294 1134.4588 1136.2153 1137.2447 1146.2235 1195.8486 1225.9077 1252.3354 1258.9533 1262.3650 1266.0958 1272.0225 1284.1663 1293.1522 1319.9596 1330.2881 1355.1126 1361.0025 1363.4294 1364.9299 1385.4014 1390.9846 1391.4113 1391.9727 1432.1978 1454.4844 1455.7269 1455.8787 1457.6398 1463.6886 1472.6881 1475.6551 1476.9509 1478.3897 1483.8034 1489.5736 1490.3699 1493.8917 1495.5601 1643.0704 2829.1956 2841.1070 2938.3629 2939.9813 2956.4704 2972.1924 2977.2674 2984.5304 2988.4912 2990.1675 2990.6525 2991.4191 2992.1434 2992.9064 2994.4912 3010.6992 3028.0226 3051.7757 3058.6288 3085.7808 3087.7027 3088.3954 3099.8100 3103.8518 3104.6815 3421.6009 3462.1390 3588.8384
redmass: 3.4248 3.7692 3.3608 3.0398 2.0838 3.0084 1.9403 2.5226 1.9393 1.9684 4.1220 3.3822 1.7071 4.3981 3.5375 2.8055 2.3364 5.0672 2.3062 3.2190 1.3267 1.2416 1.4397 1.0823 2.8962 3.7407 3.1814 3.1082 3.9089 3.4693 3.9812 5.2778 2.7775 1.6241 4.4287 1.3491 2.8170 4.9093 1.2903 1.1342 4.2059 1.0908 1.0900 1.0952 1.3549 2.6269 2.5455 2.5332 1.2292 2.5967 4.0679 1.6981 4.4122 3.5041 3.2167 3.0629 4.5410 2.4107 2.8277 2.1632 2.1968 1.1716 1.4738 1.4703 1.4779 4.3382 1.5032 1.4325 1.2612 1.1323 1.1287 1.1281 1.2143 1.0953 1.2059 1.2439 1.2701 1.3419 1.2522 1.2439 1.2527 1.4350 1.2613 1.2543 1.2574 1.0809 1.2047 1.0414 1.0419 1.0416 1.0764 1.0750 1.0515 1.0537 1.0460 1.0938 1.0780 1.0804 1.0858 1.0837 1.0901 1.0711 1.0712 1.0563 1.0562 1.0566 1.0653 1.0702 1.0649 1.0362 1.0377 1.0397 1.0788 1.1022 1.1029 1.0805 1.1066 1.0986 1.1012 1.1007 1.0985 1.0984 1.0984 1.1014 1.1013 1.1014 1.0738 1.0445 1.0979
irintensity: 0.2024 0.4767 0.8859 0.4232 1.6338 1.5860 1.0569 1.6916 3.9800 1.7140 0.6292 2.3955 2.6840 11.3582 6.2232 4.2839 2.4223 3.1699 0.8919 0.3484 1.6118 0.1163 1.0074 56.2937 16.0770 8.8393 19.2077 8.1308 16.8235 17.6780 5.8723 33.3434 47.3068 337.7783 6.1570 97.1509 14.6612 86.8347 37.9268 6.5320 62.6385 1.8123 3.1224 2.0479 12.2214 91.3204 103.9762 110.7312 9.2008 19.2596 4.6316 52.9501 440.2429 279.9275 73.1674 32.1548 35.3817 2.2179 9.1803 8.3252 9.7355 21.9434 1.5354 13.7342 5.3433 57.3923 16.9404 28.5740 3.0776 0.2842 1.5294 0.7153 0.0546 1.6742 15.3206 0.1839 0.1503 2.0093 25.6562 8.9006 2.2959 2.4013 22.8293 26.5006 38.6759 18.4703 25.5719 1.2721 23.1693 10.1380 11.8987 3.7334 5.8351 6.5281 4.0722 5.0214 11.9773 1.3774 3.4590 0.4967 33.2454 77.0656 167.9284 48.0403 66.7930 49.2011 3.8358 19.4283 10.7470 33.9407 32.8778 19.9043 17.0436 13.4097 89.0018 97.5539 36.4564 3.0458 49.8367 46.9204 39.2709 41.2755 32.0606 43.4975 32.5550 43.3420 1.8576 1.1774 0.3636
temp: 298.150 k
press: 1.00000 atm
elementType: 14 8 8 8 7 7 6 6 6 6 6 6 6 6 6 6 6 1 1 1 1 1 1 1 1 1 1 1 1 1 1 1 1 1 1 1 1 1 1 1 1 1 1 1 1
symmnumber: 1
zpe: 1024684.6 jmol-1
zpe.correction: 0.390282 hartree
zpe.thermalcorrener: 0.415672 hartree
zpe.thermalcorrenthalpy: 0.416616 hartree
zpe.thermalcorrgfe: 0.328574 hartree
zpe.sumelectzpe: -1059.135621 hartree
zpe.sumelectthermal: -1059.110231 hartree
zpe.sumelectthermalent: -1059.109287 hartree
zpe.sumelectthermalfe: -1059.197328 hartree
dipole: -0.5189 -0.9340 -2.8257
dipole: 3.0210
quadrupole: -117.0610 -101.6016 -120.0304
quadrupole: -2.7193 -8.5280 -2.3306
quadrupole: -4.1633 11.2961 -7.1327 -2.7193 -8.5280 -2.3306
hfenergy: -1059.5259029 hartree
pointgroup: C01 [X(C11H28N2O3Si1)]
dipole: 0.1992227 -0.3082592 1.1304473 debye
polarizability: 199.1146725|-3.6904076|165.381006|2.5575545|-0.6292057|146.6534338 unknown
InChI: InChI=1S/C11H28N2O3Si/c1-4-14-17(15-5-2,16-6-3)11-7-9-13-10-8-12/h13H,4-12H2,1-3H3
charge 0 multiplicity 1
45 atoms
Si 1.738053 -0.016267 0.068575
O  2.983683 -0.046413 1.264682
O  1.901143 1.308017 -1.018459
O  1.893945 -1.352971 -1.008473
N  -3.641047 0.038569 0.077972
N  -7.460997 0.182412 0.366936
C  0.109886 -0.001065 1.034716
C  -1.150774 0.025455 0.133859
C  -2.454254 -0.008274 0.957137
C  -4.943135 0.04788 0.774907
C  4.428647 0.015892 0.9913
C  1.59104 2.709501 -0.710443
C  2.070894 -2.750973 -0.596423
C  -6.115543 0.174822 -0.234302
C  5.169484 -0.244119 2.303256
C  1.614039 3.492847 -2.023509
C  2.416447 -3.564769 -1.844417
H  0.094409 -0.894237 1.691144
H  0.114656 0.874835 1.713746
H  -1.1312 -0.838984 -0.562035
H  -1.16146 0.931356 -0.501995
H  -2.489337 0.876629 1.624697
H  -2.440461 -0.908541 1.626065
H  -3.603393 -0.699324 -0.64045
H  -4.962797 0.919915 1.460052
H  -5.112264 -0.861399 1.410867
H  4.681135 1.016212 0.585102
H  4.701548 -0.738665 0.224449
H  2.344336 3.112499 -0.001724
H  0.592376 2.787777 -0.228259
H  1.132978 -3.12737 -0.134495
H  2.877954 -2.829479 0.162289
H  -5.9784 1.102434 -0.818789
H  -6.064884 -0.662943 -0.959343
H  6.263567 -0.189628 2.148553
H  4.882799 0.506885 3.059544
H  4.917752 -1.243851 2.697702
H  1.400392 4.563095 -1.841903
H  2.605097 3.405246 -2.500719
H  0.859497 3.092694 -2.7220
H  2.542611 -4.63409 -1.589941
H  1.612506 -3.471266 -2.594491
H  3.351934 -3.193305 -2.296522
H  -7.711056 -0.678877 0.861964
H  -7.673207 1.017839 0.919978
