program: Gaussian 09
title: 000078737
version: EM64L-G09RevD.01
frameworkgroup: C1[X(C13H24O)]
method: RPBEPBE
basis: SDD
operation: Freq
keyword: #pfreq=noraman
keyword: PBEPBE/SDD
title: #p freq=noraman PBEPBE/SDD
converged: YES YES NO NO
title: Mulliken charges:
elementType: O C C C C C C C C C C C C C H H H H H H H H H H H H H H H H H H H H H H H H
charge: -0.179755 -0.067526 -0.442529 -0.458961 -0.386329 -0.401357 -0.379591 -0.387261 -0.380447 -0.385654 -0.390620 -0.380299 -0.400113 -0.125850 0.231777 0.203099 0.203822 0.212158 0.203730 0.201881 0.189619 0.197371 0.217001 0.211194 0.198871 0.204930 0.185979 0.193906 0.182085 0.205327 0.208171 0.191624 0.195049 0.197872 0.187327 0.190067 0.197956 0.155476
chargesum: 0.00000
title: Mulliken charges with hydrogens summed into heavy atoms:
elementType: O C C C C C C C C C C C C C
charge: -0.179755 0.164251 -0.035609 -0.043074 0.005171 0.013014 0.030474 0.003648 -0.004456 0.027844 -0.003946 0.004900 -0.012090 0.029626
polarizability: 1.57958639e+02 -1.06662435e+00 1.37633565e+02 1.31407816e+00 -1.99825812e+00 1.19739763e+02
1716.lowfreq: -13.2042 -0.0006 -0.0002 -0.0001 4.0166 14.0746 39.0498 40.8530 98.3286
frequency: 38.8352 40.6905 98.2267 108.4334 137.1066 151.1352 187.2122 208.2965 218.7963 229.9597 259.5985 268.5868 283.0075 310.3041 338.5778 380.9696 386.3358 401.8194 480.4205 495.3530 501.7566 527.9501 699.1390 717.1979 730.3517 767.8668 783.9069 806.9619 815.0528 836.3938 888.3419 902.1496 906.7773 921.3415 942.7120 982.2971 1000.4864 1010.0401 1032.8938 1041.0669 1051.4711 1069.5104 1090.4303 1100.7836 1107.9856 1120.4180 1129.0029 1136.2970 1155.5880 1180.7834 1189.6430 1215.9103 1233.5394 1247.3969 1258.7172 1273.2666 1277.9254 1287.4455 1291.9495 1298.5610 1309.6696 1319.8702 1334.5626 1338.1810 1344.5956 1348.3831 1350.0352 1351.8833 1354.3262 1359.8243 1363.6095 1389.8747 1459.2321 1461.8061 1463.4697 1465.2159 1467.6771 1472.9241 1477.7878 1478.6864 1485.4741 1489.4637 1497.5626 1640.7728 2823.6043 2951.0544 2953.9627 2959.1780 2960.9962 2965.7143 2970.2918 2971.9142 2975.1317 2975.8878 2977.8001 2979.6203 3000.9673 3007.2649 3010.5031 3015.4628 3016.3904 3022.4984 3025.4756 3028.6578 3046.8762 3052.9033 3057.9437 3063.9242
redmass: 4.5483 6.1048 2.8299 3.0099 3.1883 2.6085 2.1123 2.3827 2.2159 2.2990 2.4522 2.2702 1.9862 2.5264 2.1419 1.9819 2.5187 2.5612 2.1580 3.0503 2.3462 2.9257 1.2374 1.3024 1.4284 1.9802 1.5587 1.7087 1.6542 2.2910 2.0434 1.8720 1.9741 2.0924 1.9371 1.7768 1.7631 2.0645 1.7476 2.1384 2.6526 2.1414 1.7530 2.2551 1.9671 2.3023 2.4414 1.6577 1.2825 1.4652 1.2928 1.3563 1.3494 1.2786 1.3049 1.2784 1.2126 1.2232 1.2230 1.1339 1.1466 1.2329 1.3376 1.3467 1.3339 1.3583 1.3924 1.3418 1.3725 1.4357 1.4506 1.2044 1.0764 1.0835 1.0832 1.0834 1.0838 1.0819 1.0809 1.0824 1.0863 1.0841 1.0876 7.8447 1.0834 1.0604 1.0607 1.0605 1.0630 1.0630 1.0618 1.0640 1.0645 1.0676 1.0657 1.0644 1.0980 1.0978 1.0991 1.0960 1.0972 1.0986 1.0974 1.0975 1.0940 1.0886 1.0945 1.0938
irintensity: 1.7011 4.8535 0.6588 0.8259 0.1250 0.2045 0.0944 0.4737 1.0132 0.0116 0.5502 0.0832 0.8947 2.3947 0.9184 1.0969 2.7380 1.5227 1.6873 1.0747 3.1654 9.4690 11.7793 16.6952 16.7402 3.6747 2.9109 0.8194 4.9807 4.5943 0.2967 10.6933 5.4082 0.2141 9.0791 3.8320 7.8297 2.1714 8.7688 0.3934 4.5987 2.8833 0.4773 1.2257 5.8111 2.8165 0.9656 3.8737 0.1739 0.3856 0.0037 5.1314 5.5885 2.3805 2.5297 1.8326 2.5481 0.1729 1.3474 1.7271 0.7073 0.3037 0.5922 2.4328 0.9412 2.3920 0.4340 1.1684 0.1790 2.0329 3.1757 0.0803 3.1033 1.9446 13.0886 9.5066 13.6371 3.3337 1.5143 8.9513 4.8210 5.1810 36.1556 184.5205 117.1527 38.7673 20.6239 15.2506 25.8387 25.5754 21.6789 40.0723 21.8945 97.2407 31.1810 20.9253 10.5455 47.2870 19.0150 13.0798 71.2070 4.5377 48.2161 107.7958 85.7736 46.9680 159.9893 4.8277
temp: 298.150 k
press: 1.00000 atm
elementType: 8 6 6 6 6 6 6 6 6 6 6 6 6 6 1 1 1 1 1 1 1 1 1 1 1 1 1 1 1 1 1 1 1 1 1 1 1 1
symmnumber: 1
zpe: 905536.5 jmol-1
zpe.correction: 0.344901 hartree
zpe.thermalcorrener: 0.360087 hartree
zpe.thermalcorrenthalpy: 0.361031 hartree
zpe.thermalcorrgfe: 0.302954 hartree
zpe.sumelectzpe: -583.834130 hartree
zpe.sumelectthermal: -583.818944 hartree
zpe.sumelectthermalent: -583.818000 hartree
zpe.sumelectthermalfe: -583.876077 hartree
dipole: 2.4268 -0.4914 2.4627
dipole: 3.4923
quadrupole: -100.9451 -85.7771 -92.1802
quadrupole: 1.2000 -10.4472 0.1452
quadrupole: -7.9776 7.1904 0.7873 1.2000 -10.4472 0.1452
hfenergy: -584.1790311 hartree
pointgroup: C01 [X(C13H24O1)]
dipole: -0.9563305 -0.2028337 -0.9654283 debye
polarizability: 157.9051914|1.5944284|137.634217|1.0135199|2.3057144|119.7925584 unknown
InChI: InChI=1S/C13H24O/c14-12-13-10-8-6-4-2-1-3-5-7-9-11-13/h12-13H,1-11H2
charge 0 multiplicity 1
38 atoms
O  3.87931 -0.074185 1.341693
C  1.875046 -0.354007 -0.079076
C  1.425032 -1.778754 -0.539184
C  1.630851 0.741164 -1.169076
C  -0.108945 -1.94402 -0.718736
C  1.360675 2.165551 -0.608949
C  -0.928373 -1.743572 0.579536
C  0.136046 2.275532 0.341732
C  -2.468515 -1.8360 0.390443
C  -1.1959 1.771534 -0.266994
C  -3.148041 -0.733585 -0.47268
C  -2.279712 1.437156 0.786137
C  -3.474614 0.614924 0.232594
C  3.360962 -0.383241 0.242348
H  1.343382 -0.089951 0.850912
H  1.776143 -2.521495 0.206532
H  1.930799 -2.025444 -1.495826
H  0.786057 0.430909 -1.810815
H  2.51146 0.785059 -1.845033
H  -0.302918 -2.963531 -1.11116
H  -0.466959 -1.248493 -1.502874
H  1.216025 2.848898 -1.470658
H  2.259518 2.526462 -0.069668
H  -0.671678 -0.77212 1.036715
H  -0.618241 -2.51813 1.311704
H  0.029477 3.331022 0.662895
H  0.345132 1.704677 1.269193
H  -2.949186 -1.843793 1.390937
H  -2.695451 -2.823124 -0.064502
H  -0.993441 0.857776 -0.852199
H  -1.589328 2.514988 -0.990371
H  -4.112774 -1.140372 -0.838834
H  -2.548035 -0.546506 -1.385277
H  -2.670317 2.374673 1.232417
H  -1.810304 0.881465 1.622432
H  -4.034028 1.245065 -0.490781
H  -4.175784 0.411108 1.068584
H  4.005028 -0.708541 -0.621514
