program: Gaussian 09
title: 000078736
version: EM64L-G09RevD.01
frameworkgroup: C1[X(C6H11N3)]
method: RPBEPBE
basis: SDD
operation: Freq
keyword: #pfreq=noraman
keyword: PBEPBE/SDD
title: #p freq=noraman PBEPBE/SDD
converged: YES YES NO NO
title: Mulliken charges:
elementType: N N N C C C C C C H H H H H H H H H H H
charge: -0.097115 -0.570745 -0.102735 -0.368600 -0.347728 -0.366644 -0.187516 -0.204717 -0.322404 0.213980 0.218894 0.205083 0.239968 0.177540 0.207232 0.257606 0.255143 0.249711 0.263795 0.279251
chargesum: 0.00000
title: Mulliken charges with hydrogens summed into heavy atoms:
elementType: N N N C C C C C C
charge: -0.097115 -0.027699 -0.102735 0.064274 0.097324 0.018127 0.070090 0.050427 -0.072693
polarizability: 1.02841316e+02 3.90634134e+00 7.86121592e+01 -7.89639034e+00 2.49274833e+00 5.86729621e+01
1716.lowfreq: -12.0889 -6.8324 -1.4290 -0.0008 -0.0008 -0.0006 28.1359 63.2638 81.3326
frequency: 27.7798 63.1878 81.3264 114.4098 210.2514 237.3475 318.5415 329.9538 447.2177 579.8831 625.0561 653.0035 717.2287 721.8566 764.3824 773.8377 839.1488 853.1742 880.5552 967.0974 1006.3410 1037.1643 1054.4719 1077.8709 1102.4515 1111.0195 1124.0753 1217.1570 1222.4228 1252.9241 1267.2546 1285.7011 1301.3246 1334.4311 1356.6436 1368.2866 1392.8508 1440.4022 1466.9900 1475.2876 1488.3178 1495.6684 1640.5707 2856.3785 2986.1185 2996.9500 3010.4413 3046.6498 3074.8757 3220.3132 3227.8106 3248.9761 3464.9116 3593.3461
redmass: 3.0622 2.0062 4.5063 2.4120 1.8222 1.6138 4.2465 2.6437 2.9194 1.2934 3.0333 3.3962 3.3523 1.3960 1.0921 1.4270 1.4123 1.2449 5.8245 1.8068 4.0276 2.7409 1.8589 2.1675 2.0747 2.1862 1.4810 1.5260 1.6031 1.5090 1.7621 1.0778 1.3105 5.3069 1.6070 2.0036 1.4389 2.3578 1.6666 1.4015 1.3681 1.1432 1.0938 1.0717 1.0650 1.0623 1.0829 1.0999 1.1036 1.0909 1.0970 1.1099 1.0450 1.0980
irintensity: 2.3345 1.6207 0.8586 0.7495 21.7060 39.2915 1.8032 1.6312 24.4908 234.1663 6.5194 16.9382 12.6732 24.1035 5.0694 74.0596 2.6847 0.0627 10.0215 1.4996 14.1991 14.6607 14.6025 3.6605 11.9567 12.3710 19.5100 15.2909 13.0738 5.8812 24.9976 4.1570 2.8515 0.9801 6.6560 12.4242 19.0418 36.3616 0.6444 7.4834 6.5460 14.1961 40.3871 124.2698 2.4543 41.5573 54.0003 1.1519 47.3653 2.5153 2.8517 4.0989 0.6103 0.7005
temp: 298.150 k
press: 1.00000 atm
elementType: 7 7 7 6 6 6 6 6 6 1 1 1 1 1 1 1 1 1 1 1
symmnumber: 1
zpe: 445319.7 jmol-1
zpe.correction: 0.169613 hartree
zpe.thermalcorrener: 0.179122 hartree
zpe.thermalcorrenthalpy: 0.180066 hartree
zpe.thermalcorrgfe: 0.133433 hartree
zpe.sumelectzpe: -398.763208 hartree
zpe.sumelectthermal: -398.753700 hartree
zpe.sumelectthermalent: -398.752756 hartree
zpe.sumelectthermalfe: -398.799388 hartree
dipole: -5.0828 1.2569 2.5691
dipole: 5.8323
quadrupole: -61.5724 -48.9026 -59.2407
quadrupole: 2.7047 -0.3024 -1.2463
quadrupole: -5.0005 7.6693 -2.6688 2.7047 -0.3024 -1.2463
hfenergy: -398.9328215 hartree
pointgroup: C01 [X(C6H11N3)]
dipole: 1.9862244 -0.9086466 0.7031397 debye
dipolederiv: -0.8198264 0.0351464 -0.1661409 0.0054821 -0.0463576 0.0085065 -0.243919 0.0231246 -0.2194946 -0.5804451 0.0665211 0.1329482 0.0301899 -0.4738435 0.2502415 0.1817526 0.2539051 -0.5880789 -0.5976849 0.0376086 -0.072523 -0.0216514 -0.2845865 0.0061954 -0.142765 0.0048643 -0.2902391 0.5998125 0.0023276 0.078673 0.02656 0.2168798 -0.0249846 0.1325017 -0.0253621 0.3172193 -0.165397 0.0243911 -0.0120774 0.0208514 0.1244948 0.0503598 -0.0516831 0.0116578 -0.007338 0.4631003 0.0087509 -0.2191298 -0.0568477 0.3473976 -0.0798006 -0.1062873 -0.1311052 0.4442517 0.1596827 0.0161391 0.1211093 0.2514284 -0.1099148 0.0786943 0.2059802 0.0163472 -0.1218981 0.4847693 -0.1243746 0.1794655 -0.3094893 0.0984123 -0.0291737 0.1974715 -0.0061776 -0.0562615 -0.020637 0.0703286 0.1159698 0.0741015 0.1101449 0.0578162 0.0881794 0.0926787 -0.1355043 0.0160195 0.0036598 -0.0106432 -0.0376701 -0.055136 -0.1342175 -0.0154433 -0.0694892 0.0089855 -0.012776 0.0083504 -0.0332712 0.0419373 -0.048255 0.1441259 -0.0352474 0.0780338 -0.0211406 0.0469109 -0.0405316 -0.0071874 -0.0313549 -0.0785405 -0.125971 -0.0179368 -0.0892652 -0.0122197 0.0619788 0.0374141 -0.0143214 0.0386101 -0.037316 0.0969979 -0.0234571 0.0851137 -0.0106134 -0.0409837 -0.0071411 0.0537697 -0.006545 -0.1315911 0.2180456 0.0429877 0.1555723 -0.1863441 0.0398653 -0.0221224 0.0026591 -0.0454447 -0.0956764 -0.1326491 0.0002026 -0.0976891 -0.040383 0.0911256 0.1034027 -0.0423782 0.063402 0.0082237 -0.0185078 -0.0527204 -0.0030928 0.1983686 0.0834599 -0.0630641 -0.0632495 -0.0456899 0.015614 -0.0508675 -0.061687 -0.0572517 0.1599356 0.0277261 -0.0827033 -0.0802577 -0.0507156 0.0496358 -0.046989 -0.0794968 -0.0596491 0.1528074 0.1929749 -0.0520247 0.0476899 -0.0299504 0.077801 -0.1792741 0.0541382 -0.0951996 0.2251255 -0.0296755 -0.0220787 -0.0111048 0.0827963 0.3126134 -0.0885482 -0.0725707 -0.0870159 0.182822 unknown
polarizability: 102.9365529|-0.2006093|77.0512676|8.6898334|5.7351964|60.1386163 unknown
InChI: InChI=1S/C6H11N3/c7-2-1-4-9-5-3-8-6-9/h3,5-6H,1-2,4,7H2
charge 0 multiplicity 1
20 atoms
N  -0.804107 -0.01466 0.405272
N  4.057583 -0.067231 -0.739875
N  -2.828265 0.747617 -0.29313
C  0.578137 -0.006107 0.916517
C  1.639076 -0.041575 -0.206407
C  3.075088 -0.053597 0.358789
C  -1.501139 -1.123411 -0.096374
C  -1.645819 1.087402 0.259556
C  -2.74171 -0.63696 -0.517404
H  0.705751 0.90853 1.525066
H  0.710987 -0.870372 1.595139
H  1.477784 -0.942372 -0.832169
H  1.524474 0.835174 -0.868801
H  3.175093 -0.911406 1.071499
H  3.238978 0.868932 0.949627
H  -1.072271 -2.12246 -0.100674
H  -1.357028 2.089641 0.569092
H  -3.569587 -1.18772 -0.957932
H  3.996868 -0.889023 -1.348679
H  5.020608 0.135896 -0.458811
