program: Gaussian 09
title: 000078731
version: EM64L-G09RevD.01
frameworkgroup: C1[X(C8H6BrNO4)]
method: RPBEPBE
basis: SDD
operation: Freq
keyword: #p
keyword: freq=noraman
keyword: PBEPBE/SDD
title: #p freq=noraman PBEPBE/SDD
converged: YES YES NO NO
title: Mulliken charges:
elementType: Br O O O O N C C C C C C C C H H H H H H
charge: 0.046133 -0.354402 -0.168738 -0.200460 -0.166053 0.023220 0.340048 0.263616 -0.467019 -0.324434 0.206874 -0.365304 0.207782 -0.816491 0.337304 0.248115 0.233577 0.292481 0.292481 0.371270
chargesum: 0.00000
title: Mulliken charges with hydrogens summed into heavy atoms:
elementType: Br O O O O N C C C C C C C C
charge: 0.046133 0.016868 -0.168738 -0.200460 -0.166053 0.023220 0.340048 0.263616 -0.129715 -0.076319 0.206874 -0.131727 0.207782 -0.231529
polarizability: 2.06954432e+02 1.44022051e+01 1.35474230e+02 2.55062971e-02 4.22938560e-03 4.87615741e+01
1716.lowfreq: -32.8016 -3.6166 -0.0010 -0.0009 -0.0005 4.0332 9.6357 28.1114 61.3508
frequency: -32.7873 28.0798 61.3379 82.4141 101.0697 151.8410 169.2359 199.5849 280.2288 287.6573 340.5870 373.0629 420.8741 449.1936 453.4922 491.7367 538.7388 575.3699 580.4285 654.0171 686.2552 695.3773 733.9331 740.6286 765.4077 805.1725 863.5000 884.1799 953.4379 990.8527 1018.8604 1052.4724 1108.4509 1133.4947 1176.0187 1185.9345 1203.7990 1257.1803 1274.6942 1284.0111 1365.8845 1394.9471 1408.5875 1429.2721 1497.9884 1568.6531 1608.7305 1629.1841 3028.7146 3103.7129 3122.8098 3162.2937 3172.5533 3528.9540
redmass: 14.1242 13.1526 3.3989 11.0796 4.5843 5.5139 16.4142 10.6229 9.7411 5.5016 9.0511 9.3044 2.1137 8.6412 1.5070 2.9079 5.2974 7.4353 2.9084 7.8214 5.0086 6.7829 5.2002 7.7570 7.7609 1.4753 6.9016 1.8596 1.4427 1.3930 3.6654 2.8310 1.5374 1.1202 1.5349 2.6753 2.6244 1.6860 3.4723 1.4941 7.0070 5.5022 1.0982 5.5738 2.8725 7.1307 8.1969 8.0828 1.0567 1.1064 1.0896 1.0947 1.0915 1.0658
irintensity: 0.6526 0.0216 4.8951 0.9448 0.3709 0.0504 0.1955 0.6826 0.2720 0.0402 6.7702 7.2658 49.6950 0.4287 76.7416 13.3261 35.5171 40.4806 21.8284 34.3870 0.3297 3.4748 0.3666 11.5720 14.7336 61.3485 10.5311 7.5837 0.0046 12.5540 59.9856 96.4273 101.6846 3.5608 161.5108 244.5324 175.5235 52.0943 35.9612 11.0429 64.5321 50.0991 17.8374 6.2062 39.7744 78.1119 150.7680 62.7678 26.1571 1.0707 10.2322 6.4082 16.8172 63.3728
temp: 298.150 k
press: 1.00000 atm
elementType: 35 8 8 8 8 7 6 6 6 6 6 6 6 6 1 1 1 1 1 1
symmnumber: 1
zpe: 341383.7 jmol-1
zpe.correction: 0.130026 hartree
zpe.thermalcorrener: 0.142217 hartree
zpe.thermalcorrenthalpy: 0.143161 hartree
zpe.thermalcorrgfe: 0.089065 hartree
zpe.sumelectzpe: -676.440038 hartree
zpe.sumelectthermal: -676.427847 hartree
zpe.sumelectthermalent: -676.426903 hartree
zpe.sumelectthermalfe: -676.480999 hartree
dipole: -0.3740 8.8207 0.0018
dipole: 8.8286
quadrupole: -114.0240 -82.9320 -88.8854
quadrupole: 14.2150 -0.0116 -0.0085
quadrupole: -18.7435 12.3485 6.3951 14.2150 -0.0116 -0.0085
hfenergy: -676.5700643 hartree
pointgroup: C01 [X(C8H6Br1N1O4)]
dipole: 0.2740033 -3.4626153 -0.0080482 debye
dipolederiv: -0.4223156 -0.055599 0.0003434 -0.1290706 -0.059248 0.0001456 0.000002 0.000063 -0.0832239 -1.179217 -0.716906 0.0002946 -0.5918705 -0.3567635 0.0014133 0.000674 0.0017934 -0.3564908 -0.691566 -0.0746809 0.0006675 -0.3338376 -0.7712455 0.0007731 0.0002927 -0.0001025 -0.2759794 -0.50311 0.0353784 0.0005968 0.061194 -0.8303065 -0.0020797 0.0006977 -0.0019482 -0.2240254 -0.8142222 -0.0315918 0.0010175 0.0920726 -0.423988 -0.0009541 0.0015251 -0.0007117 -0.2011931 1.3948538 -0.2853961 -0.0030243 -0.4171711 1.3429054 0.004619 -0.0036007 0.0041871 0.1909658 -0.9621059 -0.0774897 0.0019506 0.0657528 -0.3880656 -0.0006651 0.0018857 -0.0004425 -0.0427009 -0.539435 0.2642555 0.0019292 -0.044558 -0.4142049 -0.0010283 0.0012918 -0.0018066 0.0234434 0.4036544 -0.191544 -0.0016409 -0.088518 -0.0561964 0.0001659 -0.0007501 0.0003428 -0.0295208 0.2436949 0.1638459 -0.0003861 0.1679775 0.3020615 0.0005109 -0.0007908 0.0003769 -0.0849471 1.173857 0.6888913 -0.0009457 0.2709876 0.4984825 0.0001943 -0.0021042 -0.0007489 0.1216767 -0.6437618 -0.2526946 0.0005286 0.2305345 0.1153753 0.0002056 0.001677 0.0013827 -0.1786287 1.6803657 0.2116073 -0.0026914 0.0057404 0.8019799 -0.0006113 -0.002848 -0.000134 0.1289416 0.3417632 0.28956 0.0003091 0.6422725 -0.0622349 -0.0008893 0.0013979 -0.0004307 0.0872448 0.2009634 -0.0101868 -0.0001048 -0.0055323 0.1279056 -0.0000988 -0.0003087 -0.0000286 0.1635369 0.0087926 0.0968683 0.0006005 0.1213273 0.0590604 -0.0004459 0.0007076 -0.0004124 0.1411701 0.028333 -0.0770736 0.0001616 -0.0510623 -0.0777441 -0.0004949 0.0002403 -0.0004258 0.1707464 -0.0557987 -0.0889509 0.0588669 -0.0707694 0.0231584 0.0756523 0.0466226 0.0685839 0.0321937 -0.0557966 -0.0887699 -0.0589512 -0.0705732 0.02368 -0.0754911 -0.0469663 -0.0684638 0.0320387 0.3910509 0.2004764 0.0004781 0.1451038 0.1453883 -0.0009214 0.0003544 -0.0010741 0.384752 unknown
polarizability: 205.8049012|16.9778514|136.6227688|-0.2862546|0.1710883|48.7625662 unknown
InChI: InChI=1S/C8H6BrNO4/c9-4-8(12)5-1-2-7(11)6(3-5)10(13)14/h1-3,11H,4H2
charge 0 multiplicity 1
20 atoms
Br 5.31424 0.335837 -0.01105
O  -2.978752 -1.743392 -0.000481
O  2.502695 1.662721 -0.008453
O  -2.204172 2.42333 0.008878
O  -3.770608 0.770551 0.006805
N  -2.550466 1.17697 0.005679
C  0.979404 -0.202622 -0.006593
C  -1.452421 0.170263 0.000374
C  -0.13599 0.66659 -0.001771
C  0.743848 -1.605714 -0.009349
C  -1.690748 -1.23988 -0.002506
C  -0.56433 -2.108601 -0.007407
C  2.352125 0.415164 -0.008697
C  3.533876 -0.566494 -0.011077
H  0.02362 1.749179 0.000333
H  1.576395 -2.316183 -0.013143
H  -0.731568 -3.193204 -0.009703
H  3.513901 -1.206075 0.887593
H  3.512665 -1.203163 -0.911794
H  -2.968216 -2.736276 -0.002839
