program: Gaussian 09
title: 000078759
version: EM64L-G09RevD.01
frameworkgroup: C1[X(C10H14ClO4P)]
method: RPBEPBE
basis: SDD
operation: Freq
keyword: #p
keyword: freq=noraman
keyword: PBEPBE/SDD
title: #p freq=noraman PBEPBE/SDD
converged: YES YES NO NO
title: Mulliken charges:
elementType: Cl P O O O O C C C C C C C C C C H H H H H H H H H H H H H H
charge: -0.057261 1.395590 -0.558368 -0.514505 -0.500001 -0.601364 0.383941 -0.225467 -0.216364 -0.327694 -0.357597 -0.651613 -0.657239 -0.184424 -0.178593 -0.114354 0.220715 0.243761 0.226286 0.240788 0.296429 0.258174 0.213416 0.229779 0.236897 0.239301 0.210601 0.231909 0.258767 0.258490
chargesum: 0.00000
title: Mulliken charges with hydrogens summed into heavy atoms:
elementType: Cl P O O O O C C C C C C C C C C
charge: -0.057261 1.395590 -0.558368 -0.514505 -0.500001 -0.601364 0.383941 0.239010 0.250710 -0.031265 -0.099423 0.028479 0.024573 0.074343 0.079897 -0.114354
polarizability: 2.16145661e+02 -1.13262666e+01 1.21232770e+02 -1.86314218e-01 1.14356660e+01 1.34832719e+02
1716.lowfreq: -13.5642 -0.0018 0.0013 0.0018 1.8406 5.8690 11.9911 25.1507 26.9828
frequency: 8.8914 25.0174 26.4640 37.8919 50.1825 67.4571 76.2212 106.4833 119.2898 149.0253 196.4966 215.4957 234.2670 245.4463 253.9497 278.0355 291.1063 296.0949 354.8386 366.9532 384.0257 414.7929 441.0207 459.0719 501.8712 571.8147 623.3288 628.0462 694.2268 698.2597 708.7047 808.0762 811.7131 815.7247 830.8825 834.3970 865.9660 880.7538 943.8280 960.1335 995.1338 1010.3777 1016.5483 1055.1955 1069.6886 1102.5893 1103.6575 1108.0542 1132.7464 1133.4049 1168.4035 1190.1915 1252.2319 1253.5517 1288.0580 1354.8031 1357.1281 1366.8607 1395.6385 1397.1651 1397.3521 1457.3079 1457.9646 1467.0800 1477.4925 1479.3315 1489.1244 1490.4268 1586.3374 1595.7397 2995.1926 2995.9388 3000.4457 3005.2435 3065.4079 3073.8260 3092.5208 3093.0761 3112.1856 3114.9113 3157.2025 3162.6367 3176.2402 3182.6852
redmass: 4.4309 2.3265 3.8674 2.5075 4.5910 2.3782 3.6535 6.9269 5.6603 6.6617 5.1076 4.3507 1.2270 1.6502 4.1198 3.4425 6.3781 4.6634 6.7809 7.3336 6.2354 3.0003 7.0822 6.5249 3.3462 8.1432 7.3727 6.3712 5.9554 4.6054 6.1739 1.0917 1.0893 1.2711 2.8625 2.2266 4.0965 4.9332 1.3402 1.3454 4.3165 2.4333 2.5122 8.9400 2.6744 1.3700 2.1905 2.2522 1.4275 1.4050 1.4774 2.3722 1.1499 1.1475 1.2514 1.2623 1.2535 6.8752 1.2459 1.7274 1.9327 1.0402 1.0393 2.3139 1.0533 1.0529 1.0812 1.0858 7.1011 7.0946 1.0378 1.0365 1.0558 1.0578 1.1077 1.1070 1.0979 1.0977 1.1026 1.1029 1.0900 1.0888 1.0968 1.0979
irintensity: 0.9235 0.6710 0.1887 1.5289 1.2204 2.1434 3.1323 1.5461 1.7376 0.9126 1.0565 6.0042 0.9049 3.0405 5.1385 18.7362 7.3253 10.5414 3.0930 42.5615 10.1955 0.0634 15.2623 12.2061 48.9762 13.1471 8.2061 20.1900 121.1667 46.8374 168.9040 5.3918 3.0511 7.0699 88.9457 152.0623 164.2345 271.9656 1.9732 1.5213 69.1609 161.7107 82.9236 89.6107 52.0163 13.8163 11.5178 19.5494 2.8284 4.7024 85.3286 146.6635 0.0492 1.2244 0.5490 4.2826 5.8201 1.8794 25.0656 20.5905 10.6213 13.9952 12.1421 228.0227 7.5769 3.0930 18.8514 1.1591 8.1265 4.8340 15.9099 18.6062 36.5533 21.2605 8.7729 7.7133 23.5472 27.0550 33.0428 37.3459 1.3976 2.3909 1.6156 1.8744
temp: 298.150 k
press: 1.00000 atm
elementType: 17 15 8 8 8 8 6 6 6 6 6 6 6 6 6 6 1 1 1 1 1 1 1 1 1 1 1 1 1 1
symmnumber: 1
zpe: 593068.7 jmol-1
zpe.correction: 0.225888 hartree
zpe.thermalcorrener: 0.244550 hartree
zpe.thermalcorrenthalpy: 0.245494 hartree
zpe.thermalcorrgfe: 0.174327 hartree
zpe.sumelectzpe: -1490.398248 hartree
zpe.sumelectthermal: -1490.379586 hartree
zpe.sumelectthermalent: -1490.378642 hartree
zpe.sumelectthermalfe: -1490.449809 hartree
dipole: 2.7621 0.8485 -3.5410
dipole: 4.5703
quadrupole: -109.4691 -100.3744 -110.8332
quadrupole: 1.0262 -9.2609 3.5734
quadrupole: -2.5769 6.5178 -3.9409 1.0262 -9.2609 3.5734
hfenergy: -1490.6241361 hartree
pointgroup: C01 [X(C10H14Cl1O4P1)]
dipole: 1.0934745 0.0537609 -1.4263844 debye
polarizability: 213.520598|-18.9836934|127.0671547|2.2882927|12.6751794|131.6233972 unknown
InChI: InChI=1S/C10H14ClO4P/c1-3-13-16(12,14-4-2)15-10-7-5-9(11)6-8-10/h5-8H,3-4H2,1-2H3
charge 0 multiplicity 1
30 atoms
Cl -5.462959 0.579331 -0.134114
P  1.661831 0.064411 0.716425
O  0.372756 -0.928551 0.089332
O  1.885081 1.121938 -0.634295
O  2.925454 -1.080938 0.67722
O  1.469664 0.768077 2.122308
C  -0.984838 -0.503864 0.067348
C  2.426925 2.498969 -0.378375
C  3.186997 -1.881707 -0.568029
C  -1.586714 0.146995 1.169083
C  -1.724466 -0.8301 -1.089046
C  2.21255 3.279489 -1.670346
C  4.473675 -2.652818 -0.298157
C  -2.957415 0.482596 1.101371
C  -3.097111 -0.505605 -1.149793
C  -3.691485 0.150562 -0.05361
H  3.499028 2.412645 -0.119962
H  1.885101 2.942507 0.476636
H  3.28464 -1.186965 -1.423247
H  2.32271 -2.54871 -0.732367
H  -0.999155 0.388073 2.060552
H  -1.226285 -1.331234 -1.923528
H  2.600975 4.308172 -1.552492
H  2.742255 2.800951 -2.511406
H  1.139257 3.336159 -1.917669
H  4.358006 -3.302954 0.585096
H  4.717075 -3.287117 -1.17084
H  5.315665 -1.963655 -0.118157
H  -3.442507 0.987398 1.941539
H  -3.68761 -0.753753 -2.036177
