program: Gaussian 09
title: 000079064
version: EM64L-G09RevD.01
frameworkgroup: C1[X(C16H22O11)]
method: RPBEPBE
basis: SDD
operation: Freq
keyword: #p
keyword: freq=noraman
keyword: PBEPBE/SDD
title: #p freq=noraman PBEPBE/SDD
converged: NO YES NO NO
title: Mulliken charges:
elementType: O O O O O O O O O O O C C C C C C C C C C C C C C C C H H H H H H H H H H H H H H H H H H H H H H
charge: -0.217755 -0.257087 -0.290019 -0.273618 -0.265510 -0.251452 -0.250556 -0.226710 -0.231393 -0.227643 -0.246625 -0.166781 -0.058095 -0.091842 -0.054935 -0.106298 -0.335413 0.333951 0.316673 0.308788 0.338342 -0.761818 -0.772626 0.297459 -0.757275 -0.757826 -0.754539 0.323444 0.294629 0.289880 0.266871 0.300757 0.252448 0.249693 0.253185 0.248666 0.253704 0.243364 0.247830 0.276661 0.257554 0.249540 0.256494 0.250005 0.248844 0.251830 0.255287 0.245709 0.244210
chargesum: 0.00000
title: Mulliken charges with hydrogens summed into heavy atoms:
elementType: O O O O O O O O O O O C C C C C C C C C C C C C C C C
charge: -0.217755 -0.257087 -0.290019 -0.273618 -0.265510 -0.251452 -0.250556 -0.226710 -0.231393 -0.227643 -0.246625 0.156663 0.236534 0.198038 0.211936 0.194459 0.166728 0.333951 0.316673 0.308788 0.338342 -0.006264 -0.004771 0.297459 0.006313 -0.007148 -0.009333
polarizability: 2.01940995e+02 -7.13416257e+00 2.21254610e+02 1.13638404e+01 -3.32149509e+00 2.03564429e+02
1716.lowfreq: -7.6556 -6.4428 -4.9361 -0.0006 -0.0003 0.0003 3.7796 17.0877 24.4646
frequency: -4.6000 17.0801 24.4456 25.3415 28.7708 32.2360 35.5883 40.0230 46.1769 50.7462 56.0665 61.8392 65.8054 68.7331 74.6898 81.9063 84.9212 104.9765 114.0014 130.9894 158.0874 162.8658 182.0696 185.1614 198.2325 218.3703 225.7058 253.6003 264.4747 279.7943 294.6233 341.1743 351.4744 381.1610 407.5486 430.0450 462.9121 483.6910 493.7448 509.6972 543.9187 551.8583 559.7261 561.0389 563.9142 570.0122 603.7955 605.5595 626.7440 633.5837 636.2504 665.0770 762.7115 779.1926 819.9704 825.2490 835.8757 857.8781 864.6819 885.3571 907.1814 933.2303 954.4393 967.3908 979.1694 987.7754 993.7918 996.6352 997.5553 1008.2434 1019.0891 1023.6504 1042.6820 1043.2487 1043.6284 1044.0570 1045.3108 1050.6606 1119.9715 1137.3685 1162.4914 1176.0127 1179.5714 1186.3948 1198.9829 1210.7937 1219.5256 1234.6014 1265.3770 1273.9941 1296.0400 1305.5293 1320.0218 1328.7949 1352.1576 1361.3819 1366.5117 1382.0953 1382.7473 1383.1217 1385.0649 1388.0959 1393.2121 1450.6812 1452.0389 1452.3911 1453.1708 1453.4775 1453.8572 1453.9402 1454.8155 1456.0605 1456.8954 1458.7792 1652.4970 1655.8810 1663.7635 1669.1458 1675.9740 3003.9408 3007.3184 3007.3250 3008.0462 3009.2059 3023.2839 3033.7858 3045.6715 3060.0972 3066.3126 3077.3899 3093.8821 3098.0633 3098.3775 3099.2505 3099.3816 3101.0962 3141.3374 3142.5550 3143.0585 3144.2291 3145.5236
redmass: 4.0050 6.7596 2.2683 2.0954 2.7906 1.9076 3.6886 3.5777 1.2773 5.8300 4.1627 3.0526 2.6975 2.1930 1.4523 2.8290 4.2082 4.5256 1.0665 5.4314 6.6967 5.4478 7.5431 7.9827 9.6103 4.6395 4.0445 4.6799 3.5283 8.6314 4.9937 4.8101 3.9598 3.5859 3.9812 3.6465 4.0738 4.3844 4.7109 4.1408 3.7580 3.3266 3.2520 3.2585 3.0811 4.2194 5.4208 5.2881 5.7549 5.1989 4.9216 4.7083 5.0886 3.7266 5.6684 5.8611 6.0500 5.3567 5.5949 7.3877 4.8285 3.7251 4.2363 3.9063 3.2032 2.2160 2.2144 2.4045 2.0616 2.3412 2.9974 2.6505 1.6633 1.6643 1.6731 1.6592 1.6587 3.3347 2.9246 2.1269 2.2520 3.2550 2.8691 3.3232 3.6183 3.5481 1.1904 1.5252 1.3081 1.2783 1.2508 1.2307 1.4395 1.3580 1.3985 1.3425 1.3960 1.2567 1.2538 1.2487 1.2439 1.2440 1.7214 1.0576 1.0539 1.0564 1.0501 1.0554 1.0558 1.0525 1.0539 1.0540 1.0532 1.0774 9.5387 9.8749 9.8698 10.2368 9.9378 1.0382 1.0384 1.0376 1.0372 1.0378 1.0580 1.0838 1.0836 1.0852 1.0852 1.0873 1.1067 1.0963 1.0957 1.0957 1.0942 1.0941 1.1022 1.1016 1.1024 1.1015 1.1017
irintensity: 1.5046 0.6249 1.8590 0.1881 1.3927 0.7332 0.1229 0.8984 2.4163 0.1718 0.1473 0.6921 4.0960 2.5071 1.4529 5.5097 0.3139 5.6579 0.4613 0.8992 2.8547 3.0123 6.7195 4.0121 4.2736 4.7026 6.0541 0.3979 8.5516 1.4988 8.9099 5.4216 14.8781 13.3417 11.0292 21.2987 2.6013 11.1663 31.2291 5.4873 7.1343 6.0984 3.0040 1.5870 2.8120 19.2075 1.1530 8.3941 8.4644 8.7479 12.0037 8.3068 5.8386 12.9946 23.1925 14.0700 29.8252 157.7115 44.0547 313.6959 92.6531 52.9989 14.3863 27.9125 108.6433 4.2198 93.7835 181.7326 96.4041 56.9313 79.7330 61.9980 6.1129 14.0189 4.7139 12.4666 13.6410 54.4902 69.1071 20.9160 48.5277 56.5835 429.6589 550.8964 489.0733 60.1578 3.4759 21.4208 14.2274 8.1662 0.9849 2.6805 5.5997 0.2927 0.7672 4.1918 8.0439 71.7547 26.5268 18.4786 127.9249 32.7611 8.3749 38.7723 20.2419 12.3996 23.6793 21.0817 0.7106 21.4404 29.8879 32.3324 7.1416 14.0668 172.6590 269.1040 112.2124 171.7008 190.0443 1.3457 0.9088 2.0258 1.5696 0.5873 9.8971 5.8136 5.7325 10.4752 3.4294 10.1545 9.8971 6.7562 8.3650 4.6109 5.5283 7.3728 8.2145 10.9767 7.8053 9.7017 8.1938
temp: 298.150 k
press: 1.00000 atm
elementType: 8 8 8 8 8 8 8 8 8 8 8 6 6 6 6 6 6 6 6 6 6 6 6 6 6 6 6 1 1 1 1 1 1 1 1 1 1 1 1 1 1 1 1 1 1 1 1 1 1
symmnumber: 1
zpe: 976100.5 jmol-1
zpe.correction: 0.371777 hartree
zpe.thermalcorrener: 0.402157 hartree
zpe.thermalcorrenthalpy: 0.403101 hartree
zpe.thermalcorrgfe: 0.303549 hartree
zpe.sumelectzpe: -1448.303054 hartree
zpe.sumelectthermal: -1448.272674 hartree
zpe.sumelectthermalent: -1448.271730 hartree
zpe.sumelectthermalfe: -1448.371281 hartree
dipole: 0.3033 1.1741 4.4890
dipole: 4.6499
quadrupole: -161.9907 -168.2368 -140.6782
quadrupole: -0.9380 15.2071 6.2612
quadrupole: -5.0221 -11.2682 16.2904 -0.9380 15.2071 6.2612
hfenergy: -1448.6748306 hartree
pointgroup: C01 [X(C16H22O11)]
dipole: 0.0263338 0.3271424 1.799724 debye
polarizability: 201.235397|-12.0340758|220.1355009|-6.9178663|-3.8080786|205.3891355 unknown
InChI: InChI=1S/C16H22O11/c1-7(17)22-6-12-13(23-8(2)18)14(24-9(3)19)15(25-10(4)20)16(27-12)26-11(5)21/h12-16H,6H2,1-5H3
charge 0 multiplicity 1
49 atoms
O  -0.957331 0.605931 -1.083479
O  1.42077 0.223478 1.587647
O  0.190999 -2.27433 1.002656
O  1.92257 0.301702 -2.054732
O  -0.094341 2.432085 0.21939
O  -3.441633 -0.413736 0.18706
O  2.83062 -1.475383 2.367841
O  1.559398 -3.632694 -0.317849
O  3.057381 2.285849 -2.534546
O  -1.112274 4.014878 -1.180903
O  -4.858722 -1.980307 -0.79618
C  1.488571 -0.330898 0.209224
C  0.260656 -1.230767 -0.045161
C  1.501799 0.875517 -0.746699
C  -1.036433 -0.402452 0.013138
C  0.125036 1.544003 -0.951853
C  -2.280846 -1.229503 -0.255762
C  2.129182 -0.465515 2.590324
C  0.958977 -3.442602 0.758291
C  2.71778 1.134782 -2.87662
C  -0.786264 3.646023 -0.037177
C  1.894122 0.190915 3.930182
C  0.943686 -4.339833 1.967999
C  -4.703291 -0.903521 -0.178609
C  3.046036 0.424195 -4.166208
C  -1.040761 4.370719 1.262902
C  -5.788005 0.055712 0.257281
H  2.419058 -0.914163 0.096243
H  0.381729 -1.702431 -1.038672
H  2.23236 1.636138 -0.421033
H  -1.114653 0.118478 0.985286
H  0.096222 2.15088 -1.871993
H  -2.383635 -1.463921 -1.329773
H  -2.260954 -2.169583 0.322155
H  0.941854 -0.178446 4.353211
H  2.709223 -0.071665 4.620608
H  1.812431 1.283696 3.823344
H  -0.026989 -4.295743 2.486362
H  1.179121 -5.3729 1.672401
H  1.723495 -3.983323 2.666442
H  3.368978 -0.610695 -3.967429
H  3.83104 0.974719 -4.704052
H  2.142583 0.371078 -4.800128
H  -0.119725 4.41267 1.867499
H  -1.408972 5.385968 1.0573
H  -1.79701 3.819205 1.849743
H  -5.800727 0.928639 -0.420238
H  -6.765871 -0.445185 0.212376
H  -5.593638 0.429434 1.275689
