program: Gaussian 09
title: 000083172
version: EM64L-G09RevD.01
frameworkgroup: C1[X(C12H11NO5)]
method: RPBEPBE
basis: SDD
operation: Freq
keyword: #p
keyword: freq=noraman
keyword: PBEPBE/SDD
title: #p freq=noraman PBEPBE/SDD
converged: YES YES NO NO
title: Mulliken charges:
elementType: O O O O O N C C C C C C C C C C C C H H H H H H H H H H H
charge: -0.169198 -0.179456 -0.179293 -0.226388 -0.236397 -0.134726 -0.499535 -0.499542 0.214469 0.214022 0.479169 -0.465760 -0.374769 -0.374603 0.356834 -0.221371 -0.221380 -0.225955 0.270688 0.269530 0.269570 0.270610 0.245429 0.245616 0.236968 0.236979 0.232332 0.232356 0.233803
chargesum: 0.00000
title: Mulliken charges with hydrogens summed into heavy atoms:
elementType: O O O O O N C C C C C C C C C C C C
charge: -0.169198 -0.179456 -0.179293 -0.226388 -0.236397 -0.134726 0.040683 0.040638 0.214469 0.214022 0.479169 0.025285 -0.137801 -0.137624 0.356834 0.010961 0.010975 0.007848
polarizability: 2.10765827e+02 7.17906940e-02 1.52814507e+02 -2.07993168e+01 5.15348456e-02 9.32023256e+01
1716.lowfreq: -9.2505 -2.9863 -0.0008 -0.0005 0.0006 4.0451 8.1630 17.9079 30.8369
frequency: -4.5168 16.5220 30.8287 45.1586 63.0473 77.1609 83.9395 106.6783 127.5623 181.4333 211.2721 294.2041 308.9566 321.6922 341.8177 402.5530 409.4700 502.1030 533.9626 546.6850 548.8954 564.4967 587.0310 617.3325 632.4281 661.1085 672.5103 699.7787 714.8783 766.0529 804.8283 818.5459 852.0370 853.6695 901.5254 933.8293 945.4848 979.2331 991.1422 996.3819 1000.6499 1006.0744 1016.9876 1027.4377 1038.2397 1090.4858 1123.7715 1148.0949 1165.5644 1175.1331 1189.6459 1192.8493 1210.2531 1232.0700 1234.8379 1293.8693 1295.9703 1327.7218 1351.6051 1388.7191 1437.3020 1442.5719 1452.7923 1466.9210 1488.9451 1597.6791 1618.2530 1667.9872 1682.5136 1723.9900 3025.2519 3029.9728 3038.9799 3085.0036 3096.0383 3102.1979 3126.1408 3128.0264 3139.2765 3153.4079 3168.3800
redmass: 4.6986 4.7562 6.1064 5.2856 5.9998 5.5215 2.1885 8.6730 6.2204 7.0123 7.3036 15.2533 8.2705 2.2076 7.4377 2.7825 6.6401 4.1717 3.5623 3.1541 4.4335 4.3755 11.2391 6.3357 6.3107 8.8736 11.9317 2.1387 3.3859 2.3179 6.0937 1.4873 4.7324 1.2485 8.1128 1.5626 1.6228 1.3955 6.0293 3.1797 1.3358 2.1810 5.5912 2.1721 5.5132 1.5161 9.3853 1.1963 11.1449 1.0546 1.1182 1.0871 1.1089 2.5355 2.5238 1.4835 2.5634 1.2716 1.4141 8.7745 1.0737 2.1999 1.0906 1.1064 2.4490 6.1282 6.1796 12.6620 11.9342 12.5617 1.0576 1.0594 1.0630 1.1037 1.1093 1.1019 1.0857 1.0887 1.0921 1.0963 1.1017
irintensity: 0.4244 0.0707 2.3923 2.5834 1.4251 2.1287 0.0468 9.9150 0.6241 2.9116 14.3936 0.0242 0.9768 1.1589 13.2325 0.0029 4.7919 19.3079 0.0541 5.5343 1.3287 19.0227 0.8535 0.0618 47.6733 65.6898 19.0449 27.7668 63.9456 61.1242 126.6890 18.1406 59.5522 0.0482 21.1126 0.0595 1.6401 0.0261 7.5129 143.7148 0.0517 0.0976 3.8179 3.6623 205.1095 6.7274 737.5549 1.2068 231.4756 0.0632 0.5471 0.2810 0.0033 58.3931 52.1925 2.0399 56.0114 0.2456 34.0649 1.1809 0.7573 9.9499 29.5721 7.1180 2.6820 0.8550 2.1780 574.0243 278.1568 6.4757 15.0048 11.3486 1.7401 0.0067 8.0170 5.7052 3.6179 2.0257 13.2328 32.8968 18.9230
temp: 298.150 k
press: 1.00000 atm
elementType: 8 8 8 8 8 7 6 6 6 6 6 6 6 6 6 6 6 6 1 1 1 1 1 1 1 1 1 1 1
symmnumber: 1
zpe: 558224.5 jmol-1
zpe.correction: 0.212616 hartree
zpe.thermalcorrener: 0.228177 hartree
zpe.thermalcorrenthalpy: 0.229121 hartree
zpe.thermalcorrgfe: 0.166348 hartree
zpe.sumelectzpe: -893.408499 hartree
zpe.sumelectthermal: -893.392939 hartree
zpe.sumelectthermalent: -893.391994 hartree
zpe.sumelectthermalfe: -893.454768 hartree
dipole: 0.1563 0.0181 1.0603
dipole: 1.0719
quadrupole: -59.8593 -111.5426 -106.4117
quadrupole: -0.1786 -1.2801 -0.0379
quadrupole: 32.7452 -18.9381 -13.8072 -0.1786 -1.2801 -0.0379
hfenergy: -893.6211155 hartree
pointgroup: C01 [X(C12H11N1O5)]
dipole: -0.0651579 0.0165522 -0.4163428 debye
polarizability: 210.3920065|0.4555393|152.7868185|-21.8224554|1.2805075|93.6038347 unknown
InChI: InChI=1S/C12H11NO5/c14-10-6-7-11(15)13(10)18-12(16)17-8-9-4-2-1-3-5-9/h1-5H,6-8H2
charge 0 multiplicity 1
29 atoms
O  1.386635 -0.023681 0.724639
O  3.004564 2.351392 0.340215
O  3.030697 -2.362457 0.237333
O  -0.709922 -0.011363 -0.032783
O  1.017592 0.033493 -1.636027
N  2.768421 -0.009178 0.395886
C  4.933848 0.789318 -0.044461
C  4.942709 -0.763801 -0.076419
C  3.489299 1.208476 0.247003
C  3.50255 -1.211197 0.194473
C  -3.108606 0.003179 -0.483034
C  -1.758303 0.011754 -1.142144
C  -3.757294 -1.223696 -0.193389
C  -3.748209 1.222424 -0.144924
C  0.575075 0.003917 -0.479225
C  -5.024987 -1.232526 0.428165
C  -5.015804 1.216208 0.476774
C  -5.656349 -0.011957 0.763497
H  5.241615 1.239491 -1.003097
H  5.58856 1.20757 0.73892
H  5.600682 -1.206252 0.690803
H  5.257583 -1.170744 -1.051909
H  -1.578051 -0.87768 -1.769915
H  -1.573664 0.922716 -1.736901
H  -3.266194 -2.17023 -0.44916
H  -3.249957 2.174643 -0.363036
H  -5.519161 -2.184594 0.649488
H  -5.502792 2.162422 0.735855
H  -6.641036 -0.017848 1.243972
