program: Gaussian 09
title: 000000252
version: EM64L-G09RevD.01
frameworkgroup: C1[X(C9H13N5O3)]
method: RPBEPBE
basis: SDD
operation: Freq
keyword: #p
keyword: freq=noraman
keyword: PBEPBE/SDD
title: #p freq=noraman PBEPBE/SDD
converged: YES YES NO NO
title: Mulliken charges:
elementType: O O O N N N N N C C C C C C C C C H H H H H H H H H H H H H
charge: -0.469950 -0.475541 -0.217460 -0.417785 -0.093672 -0.445895 -0.038241 -0.623388 -0.149940 0.178067 -0.500800 -0.080624 0.343486 -0.109328 -0.717875 -0.012057 0.150751 0.191933 0.291176 0.241147 0.239578 0.309676 0.281361 0.229997 0.193784 0.306799 0.389922 0.343110 0.307498 0.354271
chargesum: 0.00000
title: Mulliken charges with hydrogens summed into heavy atoms:
elementType: O O O N N N N N C C C C C C C C C
charge: -0.080029 -0.132430 -0.217460 -0.108109 -0.093672 -0.139095 -0.038241 0.038381 0.041993 0.178067 0.031522 0.158954 0.343486 -0.109328 -0.012733 -0.012057 0.150751
polarizability: 2.20028835e+02 5.23846500e+00 1.53831857e+02 1.44263040e+01 -6.49924747e-01 8.41681899e+01
1716.lowfreq: -10.3990 -0.0005 -0.0004 0.0006 1.7117 8.6626 34.7938 39.3908 65.7794
frequency: 34.6409 39.3814 65.7667 89.1438 128.7793 151.5434 181.4883 194.6887 226.6678 229.8814 249.6760 267.0753 272.2232 293.9056 306.2774 328.7980 336.7332 359.5553 419.4880 438.5677 454.5113 484.3318 494.2073 506.7401 521.3646 544.8020 565.6618 599.6105 629.1993 654.6298 657.8767 676.6644 693.1166 761.4016 826.1703 842.1406 871.7223 914.6649 948.8593 969.1197 999.9245 1017.2918 1033.3873 1046.0495 1084.7173 1113.8488 1135.9406 1169.7512 1189.9367 1226.5419 1237.9184 1242.2786 1278.0120 1285.4713 1299.3968 1326.0821 1329.8520 1349.8077 1366.1690 1381.8546 1406.8743 1422.1723 1459.3986 1467.7553 1478.1062 1505.1760 1576.1270 1589.9892 1596.4669 1604.2768 1649.2351 2910.4665 2935.0024 2970.8522 3047.5544 3075.0545 3078.6095 3113.1897 3217.5194 3521.1703 3532.9779 3544.3405 3563.0238 3695.1757
redmass: 4.7461 6.0448 3.6787 4.4741 7.1495 4.6074 5.6973 7.3835 1.1259 1.8864 2.0949 1.4866 1.0930 3.9392 3.7220 2.1881 3.5917 4.4240 3.7455 3.6614 4.5339 5.1280 3.6803 1.4599 3.8956 1.2253 4.1143 4.1250 3.7925 1.9271 3.4198 4.4448 7.9225 11.0899 4.0377 3.7271 3.5210 3.2586 3.2993 2.1468 3.8749 1.4719 3.1484 3.0701 2.9506 2.1383 2.7410 2.9344 2.9900 1.5194 1.4646 1.5093 1.4988 1.3761 2.8134 1.1823 1.6244 1.2399 2.0860 1.2276 1.5066 3.0188 1.0518 1.3864 1.0477 2.2421 3.9609 6.2117 1.6386 6.6868 3.4951 1.0813 1.0693 1.0415 1.0866 1.0942 1.0941 1.0990 1.0643 1.0774 1.0777 1.0456 1.0661 1.1045
irintensity: 5.4599 1.6502 6.0329 3.5018 1.8064 4.6149 2.9852 9.4653 13.9457 24.4605 3.1696 80.2203 147.2240 20.4065 11.1422 108.5029 23.1245 12.9785 11.0064 11.2668 8.4825 6.0609 28.3554 218.4389 61.4205 88.5478 22.1255 16.3749 5.2524 62.4262 15.8376 5.7727 27.7402 11.0853 19.8567 16.0861 17.2177 16.0002 14.9470 21.2292 70.5843 47.7258 98.2680 8.4641 4.6690 52.8278 6.1021 8.9887 14.0257 4.4791 16.1998 23.9836 3.2686 16.7802 48.2565 51.3689 55.3982 74.5139 84.1401 31.5002 129.2524 114.9379 12.9925 69.2648 12.9792 129.5773 218.6677 18.4871 19.5603 534.9557 484.5456 48.8738 69.1828 34.4811 9.2673 48.9449 12.3808 6.9620 167.8153 14.6963 20.9695 104.0485 6.4119 41.7716
temp: 298.150 k
press: 1.00000 atm
elementType: 8 8 8 7 7 7 7 7 6 6 6 6 6 6 6 6 6 1 1 1 1 1 1 1 1 1 1 1 1 1
symmnumber: 1
zpe: 605943.4 jmol-1
zpe.correction: 0.230792 hartree
zpe.thermalcorrener: 0.247522 hartree
zpe.thermalcorrenthalpy: 0.248467 hartree
zpe.thermalcorrgfe: 0.186691 hartree
zpe.sumelectzpe: -848.893179 hartree
zpe.sumelectthermal: -848.876448 hartree
zpe.sumelectthermalent: -848.875504 hartree
zpe.sumelectthermalfe: -848.937280 hartree
dipole: -0.6552 -11.4782 -0.4322
dipole: 11.5050
quadrupole: -74.0447 -108.9261 -97.8009
quadrupole: 19.2875 9.7238 -1.4569
quadrupole: 19.5458 -15.3355 -4.2104 19.2875 9.7238 -1.4569
hfenergy: -849.1239705 hartree
pointgroup: C01 [X(C9H13N5O3)]
dipole: -0.57352 -3.4411175 -2.8841593 debye
polarizability: 221.7867888|-2.2719291|127.9065182|3.8474025|33.9646482|108.3355742 unknown
InChI: InChI=1S/C9H13N5O3/c1-3(15)6(16)4-2-11-7-5(12-4)8(17)14-9(10)13-7/h3,6,11,13,15-16H,2,10H2,1H3
charge 0 multiplicity 1
30 atoms
O  2.82468 1.405258 1.116383
O  3.53953 -1.252108 -1.444272
O  -1.696965 1.951458 2.217436
N  -0.396584 -1.70796 -0.668312
N  0.427629 0.496911 0.8454
N  -2.676078 -0.982318 -0.498202
N  -3.314126 0.890227 0.885538
N  -4.92241 -0.238881 -0.395205
C  2.776004 0.077121 0.532815
C  1.322833 -0.38333 0.464526
C  0.920806 -1.787715 0.01189
C  3.470502 0.118388 -0.869433
C  -1.332963 -0.83084 -0.139769
C  -0.947412 0.20533 0.716431
C  4.861544 0.755086 -0.785005
C  -1.968059 1.076156 1.350598
C  -3.61451 -0.064628 0.028393
H  3.352858 -0.632058 1.171882
H  1.679002 -2.184749 -0.681468
H  0.852579 -2.460457 0.89415
H  2.827525 0.683534 -1.566131
H  -0.477217 -2.026679 -1.635805
H  4.782853 1.753885 -0.326591
H  5.310017 0.84486 -1.790014
H  5.534981 0.148237 -0.145671
H  -2.982638 -1.853742 -0.936461
H  1.858066 1.647699 1.29095
H  4.403576 -1.655468 -1.176439
H  -5.169716 -0.77352 -1.224267
H  -5.605007 0.398803 0.009256
