program: Gaussian 09
title: 000083132
version: EM64L-G09RevD.01
frameworkgroup: C1[X(C10H24N2)]
method: RPBEPBE
basis: SDD
operation: Freq
keyword: #pfreq=noraman
keyword: PBEPBE/SDD
title: #p freq=noraman PBEPBE/SDD
converged: YES YES NO NO
title: Mulliken charges:
elementType: N N C C C C C C C C C C H H H H H H H H H H H H H H H H H H H H H H H H
charge: -0.278032 -0.278058 -0.366673 -0.366647 -0.391331 -0.391282 -0.375091 -0.375125 -0.321331 -0.321340 -0.690132 -0.690158 0.190257 0.187744 0.187700 0.190267 0.216874 0.179696 0.179721 0.216850 0.176797 0.206816 0.206799 0.176839 0.236641 0.236652 0.175866 0.208474 0.208462 0.175882 0.231860 0.201357 0.210201 0.201372 0.231863 0.210210
chargesum: 0.00000
title: Mulliken charges with hydrogens summed into heavy atoms:
elementType: N N C C C C C C C C C C
charge: -0.041390 -0.041406 0.011328 0.011320 0.005239 0.005289 0.008521 0.008513 0.063008 0.063004 -0.046713 -0.046713
polarizability: 1.70422453e+02 -5.93191100e-01 1.09944121e+02 2.33663865e-01 -1.30330057e+00 1.01286134e+02
1716.lowfreq: -5.0520 -0.0016 0.0010 0.0012 5.0927 22.4369 30.7034 35.4939 47.8596
frequency: 22.4390 35.4926 47.8543 53.4768 88.7505 92.7125 93.2771 122.9956 138.3812 145.6752 156.9318 176.0199 186.4349 245.5158 246.1120 268.9182 349.2431 391.5788 450.3010 493.3720 499.3526 666.8325 671.7113 729.0434 751.1269 797.1487 810.1009 813.5074 878.3609 901.4461 907.7520 980.6655 996.5938 1005.9435 1030.7855 1053.1710 1061.1149 1076.8780 1080.1149 1101.9731 1102.4379 1112.3614 1125.5341 1152.9522 1153.5673 1189.1945 1195.1892 1226.7320 1227.9473 1254.7597 1257.2138 1274.5359 1274.9058 1280.7999 1287.6100 1293.0078 1314.6965 1334.7072 1348.3339 1357.4939 1383.8803 1384.6943 1392.9619 1393.3672 1444.7526 1445.0671 1464.1921 1465.2871 1470.5497 1471.2272 1471.4057 1479.2895 1480.3413 1483.1099 1490.5646 1492.2266 1501.0786 1501.2562 2835.4185 2835.6080 2848.2184 2848.3882 2952.5350 2952.6925 2956.3390 2964.3291 2978.1613 2978.2068 2989.8378 2990.2394 2991.0053 2996.7315 2996.7738 3011.6752 3035.7506 3047.0937 3070.1390 3070.1464 3092.4887 3092.5111 3415.4832 3415.5418
redmass: 3.5933 3.6210 1.5591 3.2752 1.5637 3.4505 3.2224 1.6260 2.7569 1.8684 2.4400 3.0664 4.4001 1.1628 1.1450 3.1037 3.2993 3.3523 2.9530 3.0499 2.8942 1.3643 1.3536 1.0677 1.0961 1.1399 1.0958 1.1176 1.3017 1.7360 1.5250 1.1871 4.5777 3.5789 3.3610 3.0049 2.2847 2.4238 2.0552 1.3071 1.5442 1.9453 2.6234 3.3512 3.3381 2.0911 1.5281 1.3854 1.4008 1.2209 1.2047 1.1933 1.0772 1.2300 1.0929 1.1249 1.2726 1.3199 1.4432 1.6615 1.3294 1.3277 1.3534 1.3746 1.1829 1.1846 1.0757 1.0649 1.0758 1.0568 1.0655 1.0648 1.0508 1.0782 1.0899 1.0939 1.0858 1.0865 1.0717 1.0717 1.0720 1.0720 1.0603 1.0619 1.0648 1.0620 1.0376 1.0376 1.0845 1.0833 1.0963 1.0856 1.0855 1.0993 1.1009 1.1027 1.0979 1.0979 1.1002 1.1002 1.0738 1.0738
irintensity: 0.3852 0.1183 3.4560 0.0009 0.0000 0.0098 1.8505 3.6641 0.0000 0.0000 1.9850 3.5239 0.0000 0.0226 2.2644 0.0000 0.2133 3.2702 0.0000 0.0000 11.9955 0.0098 189.3545 13.9354 0.0001 0.9953 0.0002 10.0833 0.0000 6.2201 0.0000 5.5198 0.0001 0.6510 6.4018 0.0000 0.0000 2.9012 0.0014 29.0674 0.0280 15.9826 0.0000 125.9965 0.1542 0.0001 12.4521 0.0010 6.4771 9.0551 0.0000 1.2573 0.0001 0.0000 0.8528 0.0000 17.3115 0.0000 21.2228 0.0005 0.0227 29.7521 0.0406 17.0892 52.5482 1.1911 1.6057 0.0013 0.0053 30.9414 0.5938 10.7013 0.0002 12.5815 0.0004 6.1994 0.0144 10.6489 55.5231 54.2180 107.5119 268.1476 1.0933 3.8580 0.0074 110.2144 67.0213 1.2139 0.1370 69.0561 0.0003 8.6068 77.5608 1.9761 0.0112 184.9900 27.7535 92.5820 33.2942 45.8178 2.9546 3.0733
temp: 298.150 k
press: 1.00000 atm
elementType: 7 7 6 6 6 6 6 6 6 6 6 6 1 1 1 1 1 1 1 1 1 1 1 1 1 1 1 1 1 1 1 1 1 1 1 1
symmnumber: 1
zpe: 867075.2 jmol-1
zpe.correction: 0.330251 hartree
zpe.thermalcorrener: 0.346958 hartree
zpe.thermalcorrenthalpy: 0.347902 hartree
zpe.thermalcorrgfe: 0.283796 hartree
zpe.sumelectzpe: -503.905096 hartree
zpe.sumelectthermal: -503.888390 hartree
zpe.sumelectthermalent: -503.887446 hartree
zpe.sumelectthermalfe: -503.951552 hartree
dipole: 0.0015 0.0014 -0.0008
dipole: 0.0022
quadrupole: -76.7327 -78.8368 -78.3772
quadrupole: 3.8185 8.5951 -3.6769
quadrupole: 1.2495 -0.8546 -0.3950 3.8185 8.5951 -3.6769
hfenergy: -504.2353478 hartree
pointgroup: C01 [X(C10H24N2)]
dipole: 0.0005733 -0.0005246 0.0003409 debye
polarizability: 170.422301|0.3823302|109.782746|-0.5421075|-1.7454659|101.4476616 unknown
InChI: InChI=1S/C10H24N2/c1-3-11-9-7-5-6-8-10-12-4-2/h11-12H,3-10H2,1-2H3
charge 0 multiplicity 1
36 atoms
N  -4.43939 -0.256885 -0.003597
N  4.438103 0.260627 -0.003976
C  -0.628281 0.45217 0.006321
C  0.627118 -0.448469 -0.015348
C  -1.948939 -0.349122 -0.010887
C  1.947755 0.352684 0.00115
C  -3.199947 0.550479 0.007171
C  3.19874 -0.54689 -0.014706
C  -5.69287 0.529057 -0.002016
C  5.691711 -0.525148 -0.002762
C  -6.921893 -0.396143 0.005973
C  6.92058 0.400261 -0.01093
H  -0.597978 1.099557 0.907511
H  -0.602612 1.135448 -0.868385
H  0.60173 -1.131434 0.859628
H  0.596303 -1.096311 -0.916221
H  -1.992455 -0.994577 -0.909642
H  -1.973601 -1.029278 0.867807
H  1.973031 1.03145 -0.878642
H  1.990859 0.999756 0.898781
H  -3.141894 1.244576 0.886514
H  -3.204032 1.191776 -0.897613
H  3.202316 -1.186997 0.890932
H  3.141419 -1.242126 -0.89317
H  -4.436457 -0.950852 0.758978
H  4.436029 0.953403 -0.767634
H  -5.754898 1.239775 0.862439
H  -5.703361 1.151437 -0.918974
H  5.701285 -1.145849 0.91535
H  5.754832 -1.237369 -0.865875
H  -6.896943 -1.071775 -0.86683
H  -6.945775 -1.01952 0.92093
H  -7.857965 0.190225 -0.025131
H  6.945797 1.021703 -0.927164
H  6.89416 1.077712 0.860419
H  7.856722 -0.185852 0.0229
