program: Gaussian 09
title: 000083121
version: EM64L-G09RevD.01
frameworkgroup: C1[X(C8H16N2O)]
method: RPBEPBE
basis: SDD
operation: Freq
keyword: #p
keyword: freq=noraman
keyword: PBEPBE/SDD
title: #p freq=noraman PBEPBE/SDD
converged: YES YES NO NO
title: Mulliken charges:
elementType: O N N C C C C C C C C H H H H H H H H H H H H H H H H
charge: -0.282315 -0.086350 -0.381712 -0.325454 -0.386551 -0.616129 -0.613460 0.125427 0.375513 -0.821675 -0.652029 0.215395 0.193626 0.229533 0.252783 0.310761 0.223061 0.189986 0.222841 0.193931 0.231717 0.219667 0.224000 0.243407 0.230871 0.221693 0.261462
chargesum: 0.00000
title: Mulliken charges with hydrogens summed into heavy atoms:
elementType: O N N C C C C C C C C
charge: -0.282315 -0.086350 -0.070951 0.083568 0.095766 0.019759 0.031855 0.125427 0.375513 -0.123397 -0.168874
polarizability: 1.39557589e+02 8.37508172e+00 1.03774826e+02 -9.48334355e+00 -5.90065864e+00 7.57976956e+01
1716.lowfreq: -7.2159 -4.0659 0.0002 0.0006 0.0007 10.3240 21.3146 29.4093 54.9114
frequency: 21.1094 29.2268 54.8935 61.9648 89.8003 186.5848 207.4540 210.7922 222.7172 243.9324 270.7492 341.5374 343.9152 378.3691 394.5355 426.1293 446.2394 521.5679 538.4976 580.5622 648.7352 756.2609 789.2198 820.5941 844.9223 936.3269 987.1271 996.3975 1017.9573 1035.2684 1045.8484 1047.8814 1063.1086 1081.6088 1091.2534 1139.7549 1174.4095 1202.4509 1252.8841 1267.5130 1288.3025 1303.8696 1332.5298 1376.2778 1388.3198 1409.6120 1422.0909 1442.5729 1446.6315 1460.9674 1467.0675 1475.0151 1476.0533 1476.4644 1480.2414 1486.0708 1495.5814 1584.1000 1661.0780 2852.6747 2865.2382 2880.4377 2961.8382 3013.8460 3016.9320 3018.8155 3032.3909 3035.8527 3075.3741 3088.3293 3088.4979 3094.1232 3100.3016 3213.9223 3565.7855
redmass: 3.7709 2.7326 3.9413 4.1012 2.1168 2.7642 1.7766 1.1353 1.0881 1.4579 2.6960 2.8632 2.9933 2.8000 2.6505 2.9458 2.8226 2.2862 1.5251 3.2498 1.5437 1.5481 2.0523 4.1288 2.3358 1.8974 1.3179 1.3970 2.8768 1.5922 2.8736 1.5547 2.2219 2.1096 1.3143 1.4988 1.7236 2.6899 1.6567 2.4163 2.6552 1.1755 1.3902 1.3143 1.1667 1.2372 1.1419 1.1375 1.1500 1.0602 1.0603 1.2212 1.0551 1.0672 1.0835 1.0548 1.4162 6.7109 5.4623 1.0570 1.0601 1.0653 1.0386 1.0893 1.0726 1.0605 1.0740 1.0978 1.1010 1.0995 1.0997 1.1012 1.0617 1.1154 1.0773
irintensity: 1.9856 2.2266 1.7739 5.8780 0.5395 1.0080 1.3818 0.7273 0.9734 1.1675 2.8018 7.1068 14.2713 1.9781 1.9586 4.7676 2.2508 41.8281 84.3664 1.5042 5.4821 2.7782 11.2039 11.7752 1.6248 2.6355 61.4040 12.3871 13.9331 22.1025 18.1184 4.2790 20.2300 9.0853 7.1508 5.5498 5.3064 94.4505 15.7048 4.1523 34.8980 3.6583 7.2101 7.9226 21.5501 12.7231 3.4768 1.3190 26.4449 37.5025 6.1301 104.4638 14.1243 42.7552 26.4986 15.8913 94.0519 114.3354 1.7251 87.7758 84.6738 140.7884 24.6647 28.8380 47.3343 34.1426 51.0482 25.0975 33.6044 51.3268 6.5559 23.2199 9.3325 5.4462 14.9664
temp: 298.150 k
press: 1.00000 atm
elementType: 8 7 7 6 6 6 6 6 6 6 6 1 1 1 1 1 1 1 1 1 1 1 1 1 1 1 1
symmnumber: 1
zpe: 610976.6 jmol-1
zpe.correction: 0.232709 hartree
zpe.thermalcorrener: 0.246361 hartree
zpe.thermalcorrenthalpy: 0.247305 hartree
zpe.thermalcorrgfe: 0.190693 hartree
zpe.sumelectzpe: -498.256211 hartree
zpe.sumelectthermal: -498.242559 hartree
zpe.sumelectthermalent: -498.241615 hartree
zpe.sumelectthermalfe: -498.298228 hartree
dipole: 0.1710 -3.7468 -0.2933
dipole: 3.7622
quadrupole: -59.1852 -69.1340 -70.1429
quadrupole: -6.6944 1.6388 -0.2287
quadrupole: 6.9688 -2.9799 -3.9889 -6.6944 1.6388 -0.2287
hfenergy: -498.4889202 hartree
pointgroup: C01 [X(C8H16N2O1)]
dipole: 0.0627969 1.3746588 0.5452079 debye
polarizability: 139.8126674|-10.5384333|104.5193344|5.9940732|3.1628838|74.7981087 unknown
InChI: InChI=1S/C8H16N2O/c1-7(2)8(11)9-5-6-10(3)4/h9H,1,5-6H2,2-4H3
charge 0 multiplicity 1
27 atoms
O  1.194241 -1.570107 -0.531236
N  -3.109776 0.178128 -0.063561
N  0.648248 0.685935 -0.434515
C  -1.706875 0.375071 0.366481
C  -0.745882 0.467112 -0.84611
C  -4.084238 0.594859 0.965782
C  -3.380396 -1.195128 -0.542759
C  1.543026 -0.368617 -0.29557
C  2.945906 0.010981 0.138594
C  3.29935 1.4705 0.375905
C  3.845531 -0.996312 0.294386
H  -1.347469 -0.438128 1.045391
H  -1.654392 1.324168 0.934706
H  -1.076771 1.288257 -1.507075
H  -0.762518 -0.475034 -1.418835
H  0.950226 1.635699 -0.217612
H  -3.909455 1.650048 1.242317
H  -4.039137 -0.021264 1.900038
H  -5.108425 0.514844 0.558436
H  -3.26491 -1.965984 0.260546
H  -2.696662 -1.461076 -1.365793
H  -4.413288 -1.25204 -0.93029
H  2.676289 1.9223 1.17367
H  4.351716 1.56975 0.68969
H  3.1697 2.077276 -0.542008
H  4.879482 -0.805667 0.602535
H  3.53868 -2.030872 0.106488
