program: Gaussian 09
title: 000083169
version: EM64L-G09RevD.01
frameworkgroup: C1[X(C16H20N2O4)]
method: RPBEPBE
basis: SDD
operation: Freq
keyword: #p
keyword: freq=noraman
keyword: PBEPBE/SDD
title: #p freq=noraman PBEPBE/SDD
converged: YES YES NO NO
title: Mulliken charges:
elementType: O O O O N N C C C C C C C C C C C C C C C C H H H H H H H H H H H H H H H H H H H H
charge: -0.327421 -0.427891 -0.232551 -0.309361 -0.405165 -0.412400 -0.592183 0.398202 -0.150047 0.103828 0.337897 0.232301 -0.425096 -0.375694 -0.710041 -0.703205 -0.715986 0.156777 0.310448 -0.353914 -0.270245 -0.220254 0.262670 0.242524 0.291591 0.281435 0.363257 0.304748 0.237373 0.219956 0.208116 0.269869 0.229419 0.228045 0.202594 0.268417 0.210507 0.218035 0.226451 0.218231 0.220803 0.387960
chargesum: 0.00000
title: Mulliken charges with hydrogens summed into heavy atoms:
elementType: O O O O N N C C C C C C C C C C C C C C C C
charge: -0.327421 -0.039931 -0.232551 -0.309361 -0.041908 -0.107653 -0.086989 0.398202 0.141544 0.103828 0.337897 0.232301 -0.143661 -0.138321 -0.012100 -0.043147 -0.019027 0.156777 0.310448 -0.127462 -0.052014 0.000550
polarizability: 2.28021369e+02 -2.27540929e+01 2.19372420e+02 1.37376811e+01 1.98750354e+01 1.42046094e+02
1716.lowfreq: -0.0007 0.0004 0.0007 3.0131 5.3444 10.4686 14.5562 28.4937 32.8656
frequency: 12.9559 28.3646 32.8155 44.9771 54.4756 64.4811 75.6140 97.3832 118.1455 133.9250 174.8866 183.1324 205.7701 220.2217 238.3476 249.9040 254.7568 282.5654 299.4453 310.8480 331.6868 342.7606 403.6675 421.8209 433.4880 437.4574 455.3376 461.4821 511.6003 523.6209 533.1696 552.4005 563.0684 573.3133 577.5781 612.8054 648.1408 685.1250 698.3859 705.0677 711.5018 747.4292 749.9690 751.6811 774.1981 807.4495 825.7870 847.9426 852.5765 868.1042 912.7044 915.4145 921.0299 931.4766 955.4753 955.7792 969.9596 988.4493 1012.5951 1031.4401 1033.5405 1059.8399 1083.8572 1096.5538 1132.5189 1136.3297 1164.5651 1168.6265 1185.6718 1217.6190 1233.1933 1240.6817 1257.0897 1258.7516 1270.8022 1291.6723 1298.2794 1327.2652 1347.8124 1354.8249 1371.9877 1377.6662 1392.7064 1398.8952 1423.3604 1444.8110 1458.3715 1465.6734 1467.1065 1468.1002 1469.8928 1475.3913 1479.7239 1483.5243 1502.6277 1557.9074 1586.0455 1629.5221 1631.7821 1666.5717 2986.6826 2989.7147 2994.5121 3004.7962 3015.4610 3072.4851 3077.9286 3083.0721 3096.2073 3098.3053 3112.1213 3116.4938 3123.4088 3133.2834 3149.1966 3163.3658 3220.4492 3525.0078 3575.4047 3612.3074
redmass: 4.8103 4.8155 3.6062 7.2592 5.4077 7.4436 5.1793 4.8626 4.1101 5.7336 4.2551 1.1027 4.6420 4.0817 1.0591 3.2630 1.0724 4.1127 3.4262 5.1619 2.6282 3.8848 2.7884 2.8407 2.8553 3.0987 3.4334 2.8198 2.6562 1.6783 3.4279 4.8701 3.3371 1.2476 2.4580 2.1295 2.1937 5.0117 6.8756 8.6732 5.3498 1.6211 3.1377 4.1220 3.0261 1.8868 2.6086 1.8591 2.3746 4.8858 3.9761 1.5988 1.6185 1.3818 1.2236 2.3921 1.3000 6.4790 2.1565 1.4239 1.4201 2.9460 2.3985 1.5895 1.8683 2.0215 1.6737 1.3092 1.3185 1.8849 1.5523 2.2213 2.8215 1.4553 2.9422 1.8166 1.8689 2.2114 1.4199 1.7967 1.2284 1.2307 5.1987 1.2179 2.3172 1.0484 3.7064 1.1222 1.0827 1.0862 1.0538 1.9180 1.0540 3.0856 1.0638 6.0371 6.1468 8.8182 6.9330 8.9982 1.0360 1.0357 1.0362 1.0734 1.0692 1.1029 1.0994 1.0991 1.0993 1.1004 1.0999 1.0994 1.0848 1.0894 1.0947 1.0999 1.0986 1.0643 1.0778 1.0809
irintensity: 0.8457 1.2747 0.4486 2.3052 2.9123 2.7736 3.5100 0.1954 1.4435 0.2397 2.8875 0.2748 4.4625 8.3832 0.0505 2.8270 0.1202 2.2795 2.0564 10.4292 1.4571 2.5792 0.1589 15.2441 3.2785 7.5755 2.1717 7.6141 9.2630 94.5389 37.7472 23.2551 19.3473 119.5363 11.5275 50.2314 84.9701 17.0320 9.4511 47.3875 9.4244 67.2048 21.5383 12.1662 19.2087 12.8932 8.6942 2.7858 3.0363 1.5467 4.6680 0.7683 0.9672 2.0382 2.2714 45.6724 0.0333 193.9855 8.5474 2.8328 5.6530 99.3621 103.3706 46.2079 25.4236 56.7931 238.0688 83.1076 1.5199 31.4583 13.0534 11.2896 30.5433 5.0437 22.5743 25.4960 18.6101 35.2890 9.3144 21.9194 39.2571 42.4905 34.3296 38.8616 4.2655 0.9797 4.7335 15.6079 12.6864 44.9580 3.8559 368.1379 4.5736 1.4955 58.4163 6.7409 0.2859 216.8443 1.6922 188.2681 25.1280 12.8602 29.7733 9.9143 21.7700 7.8426 21.6203 19.6359 59.6374 30.3720 4.9646 14.9239 0.1214 11.4190 38.3448 22.7866 0.1246 29.3829 60.8859 61.9027
temp: 298.150 k
press: 1.00000 atm
elementType: 8 8 8 8 7 7 6 6 6 6 6 6 6 6 6 6 6 6 6 6 6 6 1 1 1 1 1 1 1 1 1 1 1 1 1 1 1 1 1 1 1 1
symmnumber: 1
zpe: 886117.8 jmol-1
zpe.correction: 0.337504 hartree
zpe.thermalcorrener: 0.359476 hartree
zpe.thermalcorrenthalpy: 0.360421 hartree
zpe.thermalcorrgfe: 0.284378 hartree
zpe.sumelectzpe: -1030.510785 hartree
zpe.sumelectthermal: -1030.488813 hartree
zpe.sumelectthermalent: -1030.487869 hartree
zpe.sumelectthermalfe: -1030.563912 hartree
dipole: 1.7721 1.2700 2.9209
dipole: 3.6448
quadrupole: -103.7629 -132.1533 -130.6222
quadrupole: -3.0098 4.4398 -4.0563
quadrupole: 18.4166 -9.9738 -8.4427 -3.0098 4.4398 -4.0563
hfenergy: -1030.8482899 hartree
pointgroup: C01 [X(C16H20N2O4)]
dipole: 0.7247752 -0.4614547 -1.148072 debye
polarizability: 224.0388123|23.0456383|223.6762713|-16.4177157|17.1231909|141.7247997 unknown
InChI: InChI=1S/C16H20N2O4/c1-16(2,3)22-15(21)18-13(14(19)20)8-10-9-17-12-7-5-4-6-11(10)12/h4-7,9,13,17-19H,8H2,1-3H3
charge 0 multiplicity 1
42 atoms
O  -2.673133 -0.177025 -0.6163
O  0.630734 2.593267 -1.982847
O  1.522893 3.952186 -0.325977
O  -2.399205 1.031682 1.417174
N  -0.905466 1.212174 -0.370455
N  3.956201 -0.140461 -0.126676
C  0.938031 1.505693 1.360484
C  1.976671 0.597485 0.755132
C  -0.043642 2.168406 0.320312
C  1.838085 -0.810464 0.410623
C  -3.938538 -0.898134 -0.173983
C  3.096699 -1.245767 -0.140377
C  3.281272 0.96282 0.41477
C  0.780861 -1.753109 0.526667
C  -5.044988 0.135938 0.116107
C  -4.267204 -1.745948 -1.415155
C  -3.620933 -1.784549 1.047617
C  0.769616 3.01104 -0.653152
C  -2.030594 0.715237 0.249544
C  3.318469 -2.571581 -0.57502
C  0.996243 -3.076743 0.098771
C  2.250202 -3.482196 -0.449075
H  0.297897 0.962258 2.078651
H  1.423276 2.333038 1.909069
H  -0.68771 2.856897 0.902098
H  3.773759 1.92728 0.529037
H  -0.665448 0.899533 -1.311936
H  4.924809 -0.142733 -0.437673
H  -0.186547 -1.457419 0.946175
H  -5.19653 0.791925 -0.759551
H  -5.995756 -0.389212 0.322122
H  -4.784644 0.755983 0.988152
H  -3.436663 -2.435741 -1.644279
H  -4.434715 -1.098688 -2.293179
H  -5.181103 -2.33962 -1.234319
H  -3.357156 -1.170082 1.922842
H  -4.505793 -2.397755 1.298397
H  -2.783569 -2.468077 0.817339
H  4.281341 -2.887532 -0.99236
H  0.189694 -3.81351 0.185603
H  2.3849 -4.51966 -0.775016
H  1.213587 3.148165 -2.567754
