program: Gaussian 09
title: 000083111
version: EM64L-G09RevD.01
frameworkgroup: C1[X(C11H16N2)]
method: RPBEPBE
basis: SDD
operation: Freq
keyword: #pfreq=noraman
keyword: PBEPBE/SDD
title: #p freq=noraman PBEPBE/SDD
converged: YES YES NO NO
title: Mulliken charges:
elementType: N N C C C C C C C C C C C H H H H H H H H H H H H H H H H
charge: -0.193973 -0.295085 -0.339006 -0.347461 -0.410178 -0.426492 0.485116 -0.588980 -0.403207 0.474455 -0.228093 -0.399728 -0.813372 0.217807 0.203796 0.212885 0.210727 0.190258 0.210409 0.212311 0.190043 0.269586 0.218708 0.233134 0.214812 0.227350 0.228393 0.219279 0.226507
chargesum: 0.00000
title: Mulliken charges with hydrogens summed into heavy atoms:
elementType: N N C C C C C C C C C C C
charge: -0.193973 -0.025499 0.082597 0.076151 -0.009511 -0.024138 0.485116 -0.370272 -0.170073 0.474455 -0.013281 -0.172379 -0.139193
polarizability: 1.88845369e+02 -5.78030136e-01 1.34436995e+02 -1.42426759e+00 -1.95327199e+00 7.95134067e+01
1716.lowfreq: -20.3806 -11.3860 0.0003 0.0005 0.0005 3.0838 20.6458 39.7177 56.5582
frequency: 20.4215 38.8826 56.2121 122.8270 197.1597 212.6767 240.2158 274.4829 287.5857 332.2802 380.6020 432.4523 446.6876 456.5863 483.3534 518.0909 572.0467 599.9106 683.9494 693.2029 696.4997 776.9842 815.9627 843.8719 850.8959 866.7653 890.3671 930.4931 954.4061 962.3178 978.6708 1004.0147 1044.2147 1050.1828 1051.5879 1071.6337 1096.1499 1100.7078 1146.2151 1167.8200 1185.8736 1198.1578 1202.3478 1246.3679 1248.8676 1288.6169 1308.3109 1325.2393 1341.2262 1360.9946 1370.6606 1380.6133 1389.0019 1393.2876 1438.9177 1444.6652 1455.2509 1456.2985 1462.3165 1467.8699 1468.8292 1477.2821 1493.6966 1585.6009 1620.3221 2868.2896 2874.5211 2911.4724 2921.5867 2973.3781 3039.4200 3042.7002 3051.7183 3058.3196 3080.4634 3091.1313 3117.1368 3134.3435 3140.6083 3165.5892 3461.2504
redmass: 1.0293 3.1146 3.6099 3.6418 2.9729 2.9058 1.9604 3.3339 3.6146 3.2298 1.8757 2.8630 2.9140 3.2181 2.0436 4.6124 3.5061 2.9326 1.6298 2.3190 3.0717 1.5552 4.2642 1.5332 1.3897 1.5175 2.7578 2.2926 2.2107 1.3342 4.0164 1.8063 1.5508 1.7764 2.1822 1.7492 2.2228 1.6708 2.2454 3.5690 1.1606 1.7110 1.1036 1.5887 1.4756 1.2910 1.3338 1.2534 1.3478 1.8399 1.6773 3.9161 1.4292 1.2536 2.1315 1.3725 1.0747 1.0979 1.1077 1.0977 1.0599 1.6891 1.7728 5.6966 6.0618 1.0713 1.0694 1.0687 1.0706 1.0370 1.0894 1.0914 1.0974 1.0908 1.0988 1.0897 1.0858 1.0898 1.0939 1.0949 1.0754
irintensity: 0.5359 0.8795 0.7225 0.8042 8.7940 1.3130 2.5188 7.5518 3.9271 0.1368 1.5145 6.8648 1.4362 4.0169 65.7891 2.5902 0.9210 35.9208 68.3831 21.9581 12.3680 60.2095 0.3961 0.1793 6.1629 5.2652 2.1346 3.7586 31.5222 0.4954 7.2864 48.2242 13.0071 1.0770 6.0190 3.8162 15.4087 7.1071 23.2036 19.8658 0.8855 47.7425 1.7125 25.7294 86.6284 18.8343 10.6372 31.7079 2.3309 22.0627 24.9443 7.1119 1.3524 10.0615 27.8894 4.9319 2.4845 0.8229 41.6790 7.1649 9.9044 5.2598 101.6879 40.1927 185.7004 65.3730 114.6913 63.1990 114.2734 41.8444 54.0258 54.4924 23.6065 26.7523 22.1180 18.4492 6.2987 36.7541 22.7332 16.5870 1.6043
temp: 298.150 k
press: 1.00000 atm
elementType: 7 7 6 6 6 6 6 6 6 6 6 6 6 1 1 1 1 1 1 1 1 1 1 1 1 1 1 1 1
symmnumber: 1
zpe: 657299.7 jmol-1
zpe.correction: 0.250352 hartree
zpe.thermalcorrener: 0.262646 hartree
zpe.thermalcorrenthalpy: 0.263590 hartree
zpe.thermalcorrgfe: 0.210372 hartree
zpe.sumelectzpe: -537.268783 hartree
zpe.sumelectthermal: -537.256489 hartree
zpe.sumelectthermalent: -537.255545 hartree
zpe.sumelectthermalfe: -537.308763 hartree
dipole: 1.8036 -0.7417 0.5401
dipole: 2.0235
quadrupole: -69.3448 -71.3146 -83.9053
quadrupole: 0.2150 3.5932 0.0276
quadrupole: 5.5101 3.5403 -9.0504 0.2150 3.5932 0.0276
hfenergy: -537.5191349 hartree
pointgroup: C01 [X(C11H16N2)]
dipole: -0.716338 0.2955198 0.1825584 debye
polarizability: 188.8168603|0.5388905|134.3856461|2.2985312|-2.5566669|79.5932645 unknown
InChI: InChI=1S/C11H16N2/c1-10-3-2-4-11(9-10)13-7-5-12-6-8-13/h2-4,9,12H,5-8H2,1H3
charge 0 multiplicity 1
29 atoms
N  -1.003535 -0.053877 0.046547
N  -3.845791 0.283738 -0.139683
C  -1.594783 1.077908 -0.709991
C  -1.906131 -1.220614 0.135404
C  -2.966483 1.471917 -0.132692
C  -3.282194 -0.801012 0.689959
C  0.401066 -0.258506 0.026104
C  1.299935 0.852529 0.088551
C  0.969447 -1.566794 -0.011117
C  2.700461 0.682739 0.112984
C  2.370285 -1.738082 0.025311
C  3.241019 -0.631553 0.084061
C  3.624113 1.889048 0.181776
H  -1.73086 0.791776 -1.778148
H  -0.920788 1.947125 -0.6744
H  -1.46852 -1.963747 0.823845
H  -2.047053 -1.702029 -0.860298
H  -2.811379 1.888237 0.893732
H  -3.413519 2.259896 -0.765965
H  -3.961537 -1.67257 0.661372
H  -3.145701 -0.497361 1.757874
H  -4.820548 0.504311 0.098753
H  0.902209 1.871392 0.151762
H  0.332005 -2.451301 -0.09495
H  2.781618 -2.754143 -0.007361
H  4.327219 -0.778536 0.106631
H  4.244502 1.969536 -0.731351
H  3.05825 2.83092 0.286922
H  4.318691 1.813555 1.039368
