program: Gaussian 09
title: 000083091
version: EM64L-G09RevD.01
frameworkgroup: C1[X(C10H15N3)]
method: RPBEPBE
basis: SDD
operation: Freq
keyword: #pfreq=noraman
keyword: PBEPBE/SDD
title: #p freq=noraman PBEPBE/SDD
converged: YES YES NO NO
title: Mulliken charges:
elementType: N N N C C C C C C C C C C H H H H H H H H H H H H H H H
charge: -0.064656 -0.034223 -0.185732 -0.339145 -0.345068 -0.656324 -0.643528 0.185265 -0.312275 -0.358905 -0.205162 -0.206972 -0.255079 0.203259 0.253562 0.210665 0.242388 0.258149 0.207723 0.213643 0.235981 0.212112 0.218125 0.258602 0.240483 0.219865 0.222846 0.224401
chargesum: 0.00000
title: Mulliken charges with hydrogens summed into heavy atoms:
elementType: N N N C C C C C C C C C C
charge: -0.064656 -0.034223 -0.185732 0.117677 0.107985 0.023191 0.022690 0.185265 -0.053673 -0.118422 0.014703 0.015874 -0.030679
polarizability: 2.39766127e+02 1.55066793e-01 1.25699195e+02 2.71004856e+00 1.30318525e+01 7.77664013e+01
1716.lowfreq: -7.9896 -3.4359 0.0004 0.0006 0.0006 8.7511 28.5750 40.5676 60.5745
frequency: 28.5656 40.2789 60.3507 79.9463 114.1215 130.3022 201.1035 224.4509 254.3541 285.3104 294.0983 324.8995 349.0243 408.4599 449.3334 488.3235 525.9551 555.8789 610.2567 629.3222 696.6250 745.0647 769.5622 775.4766 797.5297 848.0888 871.5048 923.7228 948.1762 977.8479 984.1419 990.3910 996.8387 1017.3574 1065.7261 1071.4564 1075.9766 1086.9742 1090.7044 1159.6974 1167.3554 1192.4003 1225.8081 1244.5279 1303.4286 1322.3710 1331.2734 1339.6609 1357.9240 1372.7966 1379.2167 1386.9987 1388.1403 1441.0648 1444.3082 1464.9904 1465.5111 1470.5605 1471.0576 1482.7119 1485.7516 1582.4079 1604.9801 2985.7091 2987.9239 2996.2771 3005.1563 3064.2478 3069.3414 3083.2068 3086.6188 3100.0425 3108.6192 3121.3661 3130.9990 3148.4484 3160.2331 3168.2146
redmass: 3.4825 2.9558 2.8115 3.7299 2.3941 3.9958 1.1417 1.3749 2.0914 4.7670 3.4091 2.9664 3.7233 2.9328 2.8268 4.3192 3.2180 4.2014 6.3570 4.6201 1.8486 2.0480 1.2380 1.7712 1.5382 1.2480 3.6550 1.4699 2.2238 1.3641 6.1066 1.3040 2.7209 2.0952 1.9770 1.8294 1.8049 1.9171 1.7502 1.4262 1.0565 2.1406 2.0209 1.8534 1.3740 1.7375 2.4000 1.2439 1.7756 2.0435 1.3559 1.2429 3.6435 1.9371 1.2447 1.0686 1.1130 1.1836 1.7419 1.0592 1.0510 6.2361 6.2376 1.0355 1.0357 1.0644 1.0586 1.1025 1.0986 1.1004 1.0984 1.1021 1.1009 1.0845 1.0885 1.0928 1.0957 1.0995
irintensity: 0.0644 0.5754 0.3861 3.1527 2.5911 0.0284 0.3517 1.2940 0.1963 0.8056 0.5255 0.5433 0.3638 0.0203 2.8413 7.4877 16.9664 25.4655 1.8353 6.2531 48.3499 18.3647 2.9181 60.2233 9.4249 0.0142 0.2036 7.6751 9.1198 0.0056 0.9983 0.8607 8.9289 12.0540 10.3348 43.5206 37.3691 77.1581 13.4530 5.0966 0.1834 5.7919 47.9793 22.5697 16.3579 47.1620 238.2373 8.5839 1.8672 112.5075 22.8057 18.1781 74.8659 15.0410 24.8621 2.2517 24.6327 45.5464 14.0354 8.7592 11.9421 5.0558 20.4942 28.9120 33.6028 49.5453 49.7533 5.3977 3.0835 38.2594 45.3312 32.7511 29.3875 3.8983 13.1372 29.3254 27.7965 17.8942
temp: 298.150 k
press: 1.00000 atm
elementType: 7 7 7 6 6 6 6 6 6 6 6 6 6 1 1 1 1 1 1 1 1 1 1 1 1 1 1 1
symmnumber: 1
zpe: 616608.2 jmol-1
zpe.correction: 0.234854 hartree
zpe.thermalcorrener: 0.248292 hartree
zpe.thermalcorrenthalpy: 0.249237 hartree
zpe.thermalcorrgfe: 0.193377 hartree
zpe.sumelectzpe: -553.280627 hartree
zpe.sumelectthermal: -553.267188 hartree
zpe.sumelectthermalent: -553.266244 hartree
zpe.sumelectthermalfe: -553.322103 hartree
dipole: -3.0981 -0.2891 -0.0524
dipole: 3.1120
quadrupole: -63.3078 -73.3964 -81.1828
quadrupole: 0.5460 0.3222 2.9862
quadrupole: 9.3212 -0.7674 -8.5538 0.5460 0.3222 2.9862
hfenergy: -553.5154802 hartree
pointgroup: C01 [X(C10H15N3)]
dipole: 1.2149737 -0.0458772 0.1439965 debye
polarizability: 239.4274626|4.0612998|84.3434173|6.2726021|-20.8350327|119.4608433 unknown
InChI: InChI=1S/C10H15N3/c1-3-13(4-2)12-11-10-8-6-5-7-9-10/h5-9H,3-4H2,1-2H3
charge 0 multiplicity 1
28 atoms
N  2.256497 0.058651 0.258252
N  0.933978 -0.093031 0.545992
N  0.129204 0.217875 -0.452327
C  2.751735 0.510219 -1.062388
C  3.184627 -0.312778 1.340596
C  2.733046 2.048131 -1.212542
C  3.791713 -1.722657 1.164911
C  -1.258083 0.038201 -0.142908
C  -1.776506 -0.420885 1.102971
C  -2.159232 0.357754 -1.193679
C  -3.168166 -0.551757 1.278546
C  -3.551514 0.222881 -1.009038
C  -4.064621 -0.232493 0.228132
H  3.777082 0.115889 -1.183225
H  2.101778 0.057275 -1.832739
H  3.989923 0.445508 1.387878
H  2.613184 -0.259054 2.282241
H  1.699976 2.422368 -1.12402
H  3.355711 2.535793 -0.440815
H  3.125625 2.335792 -2.205106
H  2.995184 -2.486698 1.163026
H  4.354912 -1.806869 0.217681
H  4.487768 -1.943532 1.994808
H  -1.080776 -0.666838 1.91105
H  -1.74232 0.70876 -2.143866
H  -3.561343 -0.905188 2.239259
H  -4.235019 0.472687 -1.828548
H  -5.145466 -0.337705 0.373858
