program: Gaussian 09
title: 000083088
version: EM64L-G09RevD.01
frameworkgroup: C1[X(C8H9N3O7)]
method: RPBEPBE
basis: SDD
operation: Freq
keyword: #pfreq=noraman
keyword: PBEPBE/SDD
title: #p freq=noraman PBEPBE/SDD
converged: YES YES NO NO
title: Mulliken charges:
elementType: O O O O O O O N N N C C C C C C C C H H H H H H H H H
charge: -0.217627 -0.177863 -0.413077 -0.399298 -0.219026 -0.228047 -0.254853 -0.123323 -0.377709 -0.384620 -0.316777 -0.439724 -0.433014 0.214192 0.182360 0.178729 0.202093 0.214505 0.364804 0.272384 0.265224 0.302587 0.274005 0.367087 0.373336 0.385850 0.387802
chargesum: 0.00000
title: Mulliken charges with hydrogens summed into heavy atoms:
elementType: O O O O O O O N N N C C C C C C C C
charge: -0.217627 -0.177863 -0.027227 -0.011496 -0.219026 -0.228047 -0.254853 -0.123323 -0.010623 -0.011284 0.048027 0.097884 0.143578 0.214192 0.182360 0.178729 0.202093 0.214505
polarizability: 1.64970423e+02 4.56861042e+00 1.17339145e+02 1.08657968e+00 5.64000021e+00 1.06087646e+02
1716.lowfreq: -7.9535 -2.1467 -0.0003 0.0002 0.0003 5.1130 34.3777 37.1894 40.4434
frequency: 34.3575 37.1140 40.4144 46.4279 59.4292 69.3060 113.3627 146.0852 162.8986 173.0122 191.5342 201.7141 265.6567 295.1820 339.0454 348.9529 374.8309 432.3975 457.8986 473.7017 489.8112 493.7168 509.8562 565.2969 587.5784 600.8042 625.0655 636.7341 637.0016 660.5276 683.1326 721.5102 728.1300 774.3995 822.4502 873.3565 886.6264 926.4444 955.5035 981.6612 984.1124 1005.4916 1045.3764 1064.1881 1163.8124 1184.4267 1192.5448 1241.1027 1245.3397 1254.4278 1269.3494 1289.3275 1311.0217 1344.3661 1351.5313 1370.4120 1378.4703 1386.7107 1410.4818 1440.6926 1443.5119 1625.1824 1648.7672 1668.7340 1676.1401 1678.4975 2850.2481 2906.1748 2910.1331 3062.4407 3074.4164 3511.6566 3514.7846 3519.4615 3522.2760
redmass: 8.7558 6.8710 7.9977 13.3398 12.2169 6.3288 9.4396 6.1551 9.9572 4.2924 3.0605 5.4234 7.7729 6.3295 10.3878 8.0606 5.8101 6.3705 3.6497 6.6564 2.1791 2.8004 3.5243 3.4189 4.7621 6.6813 1.9688 1.5134 2.7442 3.9677 2.8584 6.3086 1.3994 1.7364 5.1726 4.2652 5.9449 4.6621 3.4675 3.3122 2.4011 2.6288 2.5852 2.2052 6.2666 2.7183 1.8476 1.2140 1.2759 1.3899 1.5851 3.3450 2.9889 3.6476 2.3031 1.7375 1.5828 1.6082 1.6908 1.0909 1.1142 7.3156 7.3954 8.3026 6.1949 8.0972 1.0788 1.0705 1.0696 1.0870 1.0873 1.0769 1.0641 1.0642 1.0773
irintensity: 0.1060 0.2492 0.1353 0.7088 1.3552 1.1783 3.9010 2.2351 14.5442 3.7569 6.0757 2.0644 4.5323 0.6702 4.4479 8.7423 26.1910 40.9665 13.2577 23.0072 25.6864 38.5588 55.1104 5.7725 14.6618 17.8302 54.1646 193.2541 26.6856 7.6769 32.5958 11.4543 11.0609 207.7741 19.7133 3.1552 9.9735 13.4282 24.6757 0.6378 28.1196 65.4419 416.4957 322.4073 43.9726 36.9272 81.9138 5.7264 13.4216 26.4717 12.1793 190.9337 50.8320 171.1980 162.2960 2.3287 3.3026 17.7735 48.0369 39.9763 15.3749 278.4951 240.8695 250.5450 632.0906 129.4487 257.6416 49.0721 35.5069 14.4057 3.0141 61.7448 44.2409 33.2650 65.6271
temp: 298.150 k
press: 1.00000 atm
elementType: 8 8 8 8 8 8 8 7 7 7 6 6 6 6 6 6 6 6 1 1 1 1 1 1 1 1 1
symmnumber: 1
zpe: 490280.7 jmol-1
zpe.correction: 0.186738 hartree
zpe.thermalcorrener: 0.203884 hartree
zpe.thermalcorrenthalpy: 0.204828 hartree
zpe.thermalcorrgfe: 0.139448 hartree
zpe.sumelectzpe: -999.765908 hartree
zpe.sumelectthermal: -999.748762 hartree
zpe.sumelectthermalent: -999.747818 hartree
zpe.sumelectthermalfe: -999.813198 hartree
dipole: 0.7562 0.4690 1.6772
dipole: 1.8986
quadrupole: -110.8116 -90.0995 -110.3648
quadrupole: -0.8033 2.1465 -3.0255
quadrupole: -7.0529 13.6591 -6.6062 -0.8033 2.1465 -3.0255
hfenergy: -999.9526458 hartree
pointgroup: C01 [X(C8H9N3O7)]
dipole: 0.2928164 -0.1012429 -0.6797012 debye
polarizability: 164.7677416|4.2817673|116.7454869|-4.6963922|5.6189861|106.8839858 unknown
InChI: InChI=1S/C8H9N3O7/c12-3(13)1-11(2-4(14)15)5-6(16)9-8(18)10-7(5)17/h5,9-10,12,14H,1-2H2
charge 0 multiplicity 1
27 atoms
O  -0.811133 -0.674738 -2.329686
O  -0.813559 1.276333 1.989955
O  2.060326 3.632614 -0.537791
O  3.110117 -2.724849 -0.15156
O  -4.701168 -0.579208 0.232532
O  3.207966 1.802499 0.316388
O  1.116334 -2.522181 1.007356
N  0.820354 0.180828 -0.110921
N  -2.726192 -0.741812 -1.011475
N  -2.706624 0.227879 1.151994
C  -0.530472 -0.312908 0.100925
C  0.926022 1.535987 -0.664251
C  1.827308 -0.768449 -0.618263
C  -1.344095 -0.559502 -1.196532
C  -1.316805 0.496052 1.151561
C  -3.46361 -0.396455 0.141786
C  2.184637 2.275337 -0.218199
C  1.938425 -2.052238 0.183297
H  -0.422626 -1.321074 0.575727
H  0.071839 2.142538 -0.320962
H  0.905144 1.559202 -1.779848
H  2.813529 -0.276899 -0.568589
H  1.6492 -1.062678 -1.679519
H  -3.279961 -1.067956 -1.811086
H  -3.248202 0.602975 1.937834
H  2.889211 4.115051 -0.270839
H  3.158135 -3.585549 0.346965
