program: Gaussian 09
title: 000083105
version: EM64L-G09RevD.01
frameworkgroup: C1[X(C10H14NO5PS)]
method: RPBEPBE
basis: SDD
operation: Freq
keyword: #p
keyword: freq=noraman
keyword: PBEPBE/SDD
title: #p freq=noraman PBEPBE/SDD
converged: YES YES NO NO
title: Mulliken charges:
elementType: S P O O O O O N C C C C C C C C C C H H H H H H H H H H H H H H
charge: -0.164043 0.877490 -0.497891 -0.487601 -0.470471 -0.213486 -0.210671 0.014561 0.462059 -0.512757 0.182943 -0.493717 0.372714 -0.341384 -0.371041 -0.677313 -0.471224 -0.471456 0.244663 0.210407 0.291063 0.286453 0.264445 0.223215 0.221952 0.248323 0.248834 0.244326 0.244530 0.244149 0.258289 0.242640
chargesum: 0.00000
title: Mulliken charges with hydrogens summed into heavy atoms:
elementType: S P O O O O O N C C C C C C C C C C
charge: -0.164043 0.877490 -0.497891 -0.487601 -0.470471 -0.213486 -0.210671 0.014561 0.462059 -0.057687 0.182943 -0.202654 0.372714 -0.054931 -0.106596 0.016177 0.266467 0.273621
polarizability: 2.46611485e+02 -3.09986878e+00 1.80026683e+02 2.05239233e-01 -3.98431424e+00 1.32863225e+02
1716.lowfreq: -7.2972 -3.6479 -0.0020 0.0013 0.0014 7.5408 20.2710 22.1377 37.5692
frequency: 19.9169 21.6680 37.5482 42.5611 59.9409 73.3084 89.4775 98.6282 107.7752 116.4775 134.2064 138.9912 157.9585 193.0295 208.0174 214.8998 226.4593 270.6579 296.4863 303.5321 318.3052 331.8956 387.2124 396.0455 415.7406 441.7968 494.2142 518.4262 550.2872 582.8357 626.8847 646.9785 669.0226 682.3711 711.4530 732.4023 747.9790 773.1438 793.5784 840.1308 886.6593 911.4117 948.0876 970.8129 976.9389 987.3010 1049.5508 1062.5889 1077.7168 1107.1258 1114.2682 1125.3607 1132.6606 1138.8725 1165.5780 1205.9594 1225.0917 1246.9655 1289.5015 1303.8417 1347.5054 1386.9863 1395.2051 1415.2950 1419.9667 1425.6845 1453.1877 1457.6611 1467.3534 1469.5336 1470.2801 1472.4152 1478.3696 1490.7845 1578.0546 1602.2857 2989.6128 2989.8257 3001.4671 3004.8558 3073.7445 3089.8508 3096.0155 3107.5593 3114.0109 3137.7127 3141.6698 3143.8784 3172.4036 3191.1654
redmass: 5.2370 5.2407 4.6963 5.0608 3.7248 2.6727 2.7218 1.8787 1.7180 1.5462 3.2819 3.9785 5.3405 5.9510 2.4236 1.7131 6.7409 5.3230 4.7117 5.7324 5.3771 5.6600 4.1649 5.5788 8.2909 3.7528 6.7022 4.9662 7.0708 6.0263 4.4474 7.6146 5.2171 10.3313 13.1260 6.0747 4.6131 4.7685 1.3544 1.4690 1.5290 3.2353 11.9561 9.6590 1.3889 2.5951 2.8529 1.9139 2.0015 1.2348 1.2399 1.2822 1.2938 1.5607 1.6646 8.0099 2.8698 1.5596 1.2920 1.3845 5.4768 1.2436 8.6922 3.6351 1.1312 1.1227 1.0558 1.0504 1.7793 1.0518 1.0610 1.2276 1.1373 1.0848 7.8018 6.7084 1.0352 1.0299 1.0287 1.0640 1.0979 1.0989 1.1055 1.1010 1.1050 1.1035 1.0924 1.1058 1.0886 1.0974
irintensity: 0.2408 1.0747 0.8165 3.6600 3.4359 4.7134 1.4918 2.4168 2.3581 1.4438 2.5154 1.3306 0.4945 7.6356 3.9887 4.1365 1.2438 9.1510 3.4958 8.2360 3.3519 35.7866 2.5016 7.8979 15.7280 3.5560 6.7146 1.4630 65.9348 30.8985 1.6388 176.7429 24.1799 71.5678 134.4442 71.5854 50.5321 13.2998 4.7201 34.2013 19.4879 156.7051 236.7179 192.3341 1.0479 15.6311 26.1898 19.5256 4.9446 0.4579 0.4990 1.3015 0.3669 35.4855 121.8360 540.4219 10.6367 23.5696 4.9124 1.1851 114.9109 11.0978 15.7940 48.2479 1.5011 4.9712 6.5022 17.7030 48.4865 19.6590 14.0233 8.8337 19.4717 11.8863 77.7688 187.6674 32.7024 40.3304 32.8807 25.0483 8.5178 31.6997 20.5019 21.5831 25.2308 12.4089 2.9598 7.3666 0.6922 2.9296
temp: 298.150 k
press: 1.00000 atm
elementType: 16 15 8 8 8 8 8 7 6 6 6 6 6 6 6 6 6 6 1 1 1 1 1 1 1 1 1 1 1 1 1 1
symmnumber: 1
zpe: 615974.4 jmol-1
zpe.correction: 0.234612 hartree
zpe.thermalcorrener: 0.255410 hartree
zpe.thermalcorrenthalpy: 0.256354 hartree
zpe.thermalcorrgfe: 0.181822 hartree
zpe.sumelectzpe: -1558.150418 hartree
zpe.sumelectthermal: -1558.129620 hartree
zpe.sumelectthermalent: -1558.128676 hartree
zpe.sumelectthermalfe: -1558.203208 hartree
dipole: 6.0849 -1.9000 1.6628
dipole: 6.5879
quadrupole: -140.5557 -119.0561 -113.6716
quadrupole: -15.4186 0.3924 6.3319
quadrupole: -16.1279 5.3717 10.7562 -15.4186 0.3924 6.3319
hfenergy: -1558.3850301 hartree
pointgroup: C01 [X(C10H14N1O5P1S1)]
dipole: 2.4138954 -0.538868 0.7749798 debye
polarizability: 246.4999114|2.070541|179.466891|4.8515414|-6.0337618|133.5345906 unknown
InChI: InChI=1S/C10H14NO5PS/c1-4-8-7-9(5-6-10(8)11(12)13)16-17(18,14-2)15-3/h5-7H,4H2,1-3H3
charge 0 multiplicity 1
32 atoms
S  2.806632 1.841622 -1.705638
P  3.057617 0.691487 -0.037007
O  1.967046 -0.698882 0.171987
O  4.511661 -0.192596 0.207019
O  2.94624 1.540153 1.446515
O  -4.224741 -1.881412 -0.153435
O  -4.395514 0.373413 -0.399425
N  -3.69693 -0.700787 -0.220661
C  -1.565218 0.632226 0.212242
C  -2.235244 1.976933 0.458136
C  -2.224738 -0.594626 -0.102052
C  -0.151174 0.583645 0.304554
C  0.565135 -0.609331 0.068133
C  -1.506698 -1.80077 -0.311662
C  -0.108587 -1.814365 -0.242559
C  -2.403302 2.792931 -0.853142
C  5.101578 -0.932873 -0.93406
C  3.250591 0.842977 2.729474
H  -3.226184 1.847815 0.921885
H  -1.602496 2.552775 1.159451
H  0.38586 1.501259 0.569028
H  -2.069304 -2.711031 -0.532976
H  0.467024 -2.726536 -0.418701
H  -1.430523 2.949473 -1.35316
H  -2.83963 3.782387 -0.627582
H  -3.081037 2.269952 -1.547857
H  6.092875 -1.246525 -0.576714
H  5.201322 -0.273109 -1.814758
H  4.482255 -1.813085 -1.177769
H  3.059428 1.608275 3.495496
H  4.304559 0.523197 2.744626
H  2.580599 -0.023292 2.868315
