program: Gaussian 09
title: 000082765
version: EM64L-G09RevD.01
frameworkgroup: C1[X(C5H12Cl2Si)]
method: RPBEPBE
basis: SDD
operation: Freq
keyword: #p
keyword: freq=noraman
keyword: PBEPBE/SDD
title: #p freq=noraman PBEPBE/SDD
converged: YES YES NO NO
title: Mulliken charges:
elementType: Cl Cl Si C C C C C H H H H H H H H H H H H
charge: -0.330833 -0.078879 1.077448 -0.778501 -0.301989 -0.999546 -0.998098 -0.578472 0.247489 0.248704 0.228840 0.229861 0.261071 0.238949 0.256620 0.260502 0.256989 0.238732 0.260570 0.260543
chargesum: 0.00000
title: Mulliken charges with hydrogens summed into heavy atoms:
elementType: Cl Cl Si C C C C C
charge: -0.330833 -0.078879 1.077448 -0.282308 0.156712 -0.242906 -0.241876 -0.057359
polarizability: 1.23343386e+02 9.61495166e+00 8.71450765e+01 -1.16585129e-01 -6.29982685e-02 7.91219820e+01
1716.lowfreq: -17.2951 -6.5924 0.0014 0.0016 0.0034 7.3761 30.6378 63.0128 78.8270
frequency: 29.9817 63.0112 78.7096 112.0496 133.8331 137.1501 148.0419 163.0271 187.7436 198.9926 228.8275 278.6695 341.9626 437.7986 603.8576 668.6781 696.6798 726.0122 759.5481 777.9977 815.4700 847.4099 885.2798 921.1246 991.1434 1003.1642 1060.8683 1087.5813 1201.4538 1246.0273 1268.1347 1297.2130 1308.1552 1316.0985 1332.9212 1434.9680 1437.5082 1444.3359 1444.7472 1454.4863 1458.8031 1480.6368 2986.3383 2987.8466 2988.8904 2998.6632 3038.6136 3050.7957 3062.6060 3089.0661 3090.5540 3104.3919 3105.0494 3135.2244
redmass: 3.9745 6.6622 1.9565 2.3976 1.1009 3.6427 1.1795 3.1769 3.0654 3.2118 2.5001 4.6580 5.2068 7.3293 4.6608 5.6897 1.5993 1.6726 3.6984 1.1478 1.3380 1.4608 1.4398 1.5058 1.3905 4.8724 3.2932 1.0370 1.2576 1.2973 1.2111 1.0969 1.1876 1.1930 1.3340 1.0514 1.0773 1.0475 1.0520 1.0737 1.0677 1.0908 1.0585 1.0351 1.0354 1.0587 1.1011 1.0565 1.1030 1.0974 1.0973 1.0989 1.0987 1.1118
irintensity: 3.8316 4.8964 0.2356 0.7498 0.0290 0.5119 0.0301 1.5191 3.6635 0.3383 5.4475 4.0035 17.5387 51.3138 1.0916 47.0151 0.0131 15.2287 32.2252 11.1120 13.4740 37.7120 110.9718 109.4259 26.5599 28.9631 14.8289 3.9766 27.4479 4.3738 28.8499 2.5756 47.9371 23.2322 11.2129 0.8384 5.5488 9.1460 3.7866 6.1334 16.4818 8.5020 4.0098 5.5867 4.3500 21.0907 0.0151 23.1717 23.3228 1.7413 19.6501 4.4622 11.4582 20.2248
temp: 298.150 k
press: 1.00000 atm
elementType: 17 17 14 6 6 6 6 6 1 1 1 1 1 1 1 1 1 1 1 1
symmnumber: 1
zpe: 419579.1 jmol-1
zpe.correction: 0.159809 hartree
zpe.thermalcorrener: 0.172353 hartree
zpe.thermalcorrenthalpy: 0.173297 hartree
zpe.thermalcorrgfe: 0.119186 hartree
zpe.sumelectzpe: -1406.638265 hartree
zpe.sumelectthermal: -1406.625721 hartree
zpe.sumelectthermalent: -1406.624776 hartree
zpe.sumelectthermalfe: -1406.678887 hartree
dipole: 0.2223 1.1937 0.0479
dipole: 1.2152
quadrupole: -95.8187 -70.6022 -69.6130
quadrupole: -9.2585 0.0118 -0.0282
quadrupole: -17.1407 8.0758 9.0650 -9.2585 0.0118 -0.0282
hfenergy: -1406.7980738 hartree
pointgroup: C01 [X(C5H12Cl2Si1)]
dipole: -0.0471117 0.4746924 -0.0320424 debye
dipolederiv: -0.717424 0.2109501 -0.0109309 0.2331608 -0.6103605 0.0101823 -0.0130598 0.0101888 -0.4054882 -0.7313809 0.1073542 -0.0072317 0.2642618 -0.2670034 0.0035928 -0.0081145 0.0017558 -0.1841242 1.694726 -0.1662945 0.0104413 -0.0404197 1.3996224 -0.0066448 0.0097743 -0.0078805 1.2679916 -0.574186 -0.0050721 -0.00381 -0.0700882 -0.2391202 0.0015731 -0.0029841 0.0003572 -0.1997917 -0.1202937 0.0265972 -0.0040781 -0.090308 -0.0033218 -0.0012066 -0.0018222 0.0007421 0.118591 -0.3879028 -0.0206169 -0.0105243 -0.0793551 -0.3674898 -0.0763093 -0.0177141 -0.0627792 -0.4275726 -0.3881967 -0.021154 0.0148032 -0.0819114 -0.3598524 0.069399 0.0231739 0.0585231 -0.433431 0.8023127 -0.2251069 0.0084959 -0.2314953 0.3145323 -0.0031458 0.0086368 -0.00335 0.2124847 0.0732263 -0.0322235 -0.0635453 0.019012 -0.0059346 -0.1067694 -0.0160069 -0.1072125 -0.0309047 0.0709454 -0.0332153 0.0666412 0.0169798 -0.0017387 0.1053395 0.0179512 0.1054793 -0.031676 0.0699748 -0.0025596 0.0143978 -0.0196185 -0.0087796 0.0964534 0.0059211 0.1026112 -0.0497131 0.0704861 0.0003885 -0.0109056 -0.0170049 -0.0107635 -0.0969164 -0.0030885 -0.1025788 -0.0476265 -0.0597105 -0.0860672 -0.0187586 -0.11135 0.0624776 -0.0095327 -0.0534516 -0.0233662 0.1113089 0.0235822 0.1137759 0.0115047 0.1363766 -0.02846 -0.0086558 0.0386522 -0.0382235 0.0957607 0.1148595 -0.0108142 0.0275544 0.0031643 0.0679478 0.0697274 0.0393863 0.0946024 -0.0701285 -0.0609684 -0.0883623 0.0143491 -0.1108314 0.0613818 0.0070407 0.0506345 0.0220581 0.1122717 0.117237 -0.0065461 -0.0161404 0.0059344 0.0584332 -0.0771141 -0.0276119 -0.1022932 -0.0630904 0.0234918 0.1107898 -0.0219807 0.133794 -0.022652 0.0227889 -0.0505202 0.0500929 0.0900033 -0.0106247 0.0628177 -0.0103655 0.0190349 -0.0184094 0.0830183 0.0292833 0.1037549 -0.0331368 -0.0101542 0.0653592 0.0100836 0.0206638 -0.0205091 -0.0828206 -0.0290397 -0.1024818 -0.0317282 unknown
polarizability: 121.4562976|-12.5174982|89.0170744|0.7453669|-0.3451549|79.1370719 unknown
InChI: InChI=1S/C5H12Cl2Si/c1-8(2,7)5-3-4-6/h3-5H2,1-2H3
charge 0 multiplicity 1
20 atoms
Cl 3.117663 -1.435744 0.078401
Cl -4.172798 0.420613 -0.066031
Si 1.534011 0.13475 0.001878
C  -0.123153 -0.822889 -0.009795
C  -1.367027 0.110763 -0.030533
C  1.75934 1.189188 1.565234
C  1.831209 1.10645 -1.602526
C  -2.655446 -0.715648 -0.041721
H  -0.128484 -1.493508 -0.891978
H  -0.148198 -1.479631 0.882364
H  -1.351283 0.763313 -0.92427
H  -1.372463 0.772855 0.856177
H  2.771457 1.629399 1.592214
H  1.024782 2.015846 1.595041
H  1.631395 0.576699 2.474805
H  2.837529 1.560604 -1.599528
H  1.761108 0.443019 -2.482177
H  1.088835 1.918502 -1.718315
H  -2.767932 -1.330861 0.864332
H  -2.746146 -1.340521 -0.943574
